{"text_format":"1","workbook":"xlsx","n_sheets":34,"sheets":["Info","EquipmentList","EquipmentUpgrade","EquipmentSetOption","GlobalValue","TreasureBoxConfig","NPCConfig","RewardRandomBag","MerchantConfig","SanctuaryConfig","RandomPatternConfig","WorldMapConfig","ApprearMonsterPattern","CreateMapConfig","ItemList","BattleLevelUp","ActorTalkConfig","Localization","MonsterList","CardList","PCList","SealList","BuffPatternConfig","PCAwakening","PCEvolution","PCEvolutionMax","StatusOptionSet","StatusConditionsList","Projectile","Effect","Sheet1","Sheet2","몬스터 배치 컨셉","스테이지 컨셉"],"not_rendered":{"charts":0,"images":1,"macros":1,"external_links":0,"defined_names":12,"comments":0,"pivot_tables":0},"unopened":[],"bounds":{"document_bytes":16777216,"sheet_cells":100000,"rows_first":2000,"rows_last":500,"rows_between":2000,"halvings":0,"cell_chars":16384,"cell_head_chars":4096},"cells_cut":0,"cells_raw":0,"read":"whole","date_system":"1900"}

{"sheet":"Info","index":0,"n_rows":58,"n_cols":8,"rows_kept":58,"cut":false,"hidden":false,"merged":[]}
[]
[]
[]
[]
[]
[]
[]
[]
[]
[]
[]
[]
[]
[]
[]
[]
[]
[]
[]
[]
[]
[]
[]
[]
[]
[]
[]
[]
[]
[]
[]
[]
[]
[]
[]
[]
[]
[]
[]
[]
[]
[]
[]
[]
[]
[]
[]
[]
[]
[]
[]
[]
[]
[]
[]
[]
[null,null,null,null,null,null,null,"INT((누적 횟수*등급)10)+(INT(등급*등급(누적 횟수/1.14))10)"]
[null,null,null,null,4,4,null,{"$f":"ROUNDDOWN((((F58*E58)*10)+(INT(E58*E58*(F58/1.14))*10))/100,0)","v":7}]

{"sheet":"EquipmentList","index":1,"n_rows":15,"n_cols":21,"rows_kept":15,"cut":false,"hidden":false,"merged":[]}
["n_ID","e_EquipmentType","n_Grade","n_MaxLv","n_SetGroupID","n_MainOtion","n_SubOptionCount","n_SubOtion1","n_SubOtion2","n_SubOtion3","n_SubOtion4"]
["장비 ID","장비 타입","장비 등급","최대 강화레벨","세트 효과 ID","메인 옵션 ID","보조 옵션 수","보조 옵션1 ID","보조 옵션2 ID","보조 옵션3 ID","보조 옵션4 ID"]
[30101,"Weapon",1,5,0,110001,0,0,0,0,0,null,null,"장비 컨셉","기본 능력치"]
[30201,"Weapon",2,6,0,110002,1,120001,0,0,0,null,null,"무기","공격력 (Min~Max)","경험치%","명중력","치명타 확률","치명타 피해"]
[30301,"Weapon",3,7,0,110003,2,120001,120002,0,0,null,null,"상의","실드","최대HP","원거리 회피","근거리 회피","처치 보상","희귀 스킬 확률","근접 회피"]
[30401,"Weapon",4,8,0,110004,3,120001,120002,120003,0,null,null,"하의","실드","최대HP","원거리 회피","근거리 회피","골드%"]
[30501,"Weapon",5,9,1,110005,4,120001,120002,120003,120004,null,null,"신발","실드","최대HP","이동 속도%","근거리 회피","원거리 회피"]
[30502,"Weapon",5,10,2,110006,4,120001,120002,120003,120004,null,null,"장갑","실드","경험치%","골드%","희귀 스킬 확률","치명타 피해","치명타 확률"]
[31101,"SubWeapon",1,5,1,110101,0,0,0,0,0,null,null,"방패","실드","최대HP","경험치%","치명타 피해","치명타 확률"]
[32101,"ArmorTop",1,5,2,110201,0,0,0,0,0,null,null,"반지","-","생명력","골드%","경험치%","희귀 스킬 확률","에픽 스킬 확률"]
[33101,"ArmorBottom",1,5,2,110301,0,0,0,0,0,null,null,"목걸이","-","최대 HP","경험치%","골드%","희귀 스킬 확률","에픽 스킬 확률","치명타 확률"]
[34101,"Gloves",1,5,2,110401,0,0,0,0,0]
[35101,"Shoes",1,5,2,110501,0,0,0,0,0]
[36101,"Ring",1,5,2,110601,0,0,0,0,0]
[37101,"Necklace",1,5,2,110701,0,0,0,0,0]

{"sheet":"EquipmentUpgrade","index":2,"n_rows":8,"n_cols":7,"rows_kept":8,"cut":false,"hidden":false,"merged":[]}
["n_EquipGrade","n_MaxLv","n_UpgradeGoodsID","n_UpgradeDefaultPrice","n_UpgradeIncreasePrice","n_UpgradeMainStat","n_UpgradeSubStat"]
["장비 등급","최대 강화레벨","강화 시 필요 재화 ID","강화 기본 재화 요구량","강화 단계 별 강화 가격 증가량","업그레이드 시 기본 능력치 증가 레벨","업그레이드 시 서브 능력치 증가 레벨"]
[1,3,201,100,100,2,1]
[2,3,201,250,250,4,1]
[3,5,201,500,500,6,1]
[4,5,301,10,10,8,1]
[5,9,301,25,25,10,1]
[6,9,301,50,50,12,1]

{"sheet":"EquipmentSetOption","index":3,"n_rows":5,"n_cols":12,"rows_kept":5,"cut":false,"hidden":false,"merged":[]}
["n_SetId","e_SetCondition1","e_SetStat1","s_SubStatValue1","e_SetCondition2","e_SetStat2","s_SetStatValue2","n_IncreaseMainStatSet2","n_IncreaseMainStatSet3","n_IncreaseMainStatSet4","n_IncreaseMainStatSet5","n_IncreaseMainStatSet6"]
["세트 ID","세트1 발동 조건","세트1 효과","세트1 효과 값","세트2 발동 조건","세트2 효과","세트2 효과 값","2세트 달성 메인 스텟 증가 레벨","3세트 달성 메인 스텟 증가 레벨","4세트 달성 메인 스텟 증가 레벨","5세트 달성 메인 스텟 증가 레벨","6세트 달성 메인 스텟 증가 레벨"]
[1,3,"None",0,6,"None",0,1,3,5,7,10]
[2,3,"Cri",0.01,6,"Cri",0.01,1,3,5,7,10]
[3,3,"Cri",0.02,6,"Cri",0.02,1,3,5,7,10]

{"sheet":"GlobalValue","index":4,"n_rows":11,"n_cols":3,"rows_kept":11,"cut":false,"hidden":false,"merged":[]}
["s_ID","n_Value","exception"]
["_전역변수로 사용할 대상","적용 값","참고용 텍스트"]
["ReviveTime_byDefeatUI",0.5,"부활 시 무적(일시 정지) 시간"]
["FrontMonster_ProjectileSpeed",35,"전열 투사체 이동 속도"]
["BackMonster_ProjectileSpeed",45,"후열 몬스터 투사체 이동 속도"]
["PC_ProjectileSpeed",40,"피씨 투사체 이동속도"]
["DungeonMovement_DefaultTime",2.5,"던전 탐험 중 없음 패턴의 기본 이동 시간 초(s)"]
["CampFire_Default_HP",5,"캠프 파이어에서 제공하는 기본 HP 회복량"]
["CampFire_Default_Gold",10,"캠프 파이어에서 제공하는 기본 골드 지급량"]
["CampFire_Default_EXP",5,"캠프 파이어에서 제공하는 기본 EXP 지급량"]
["ProductDiscountUnitRate",10,"상인이 판매하는 상품의 할인율 단위(10 = 10%)"]

{"sheet":"TreasureBoxConfig","index":5,"n_rows":13,"n_cols":9,"rows_kept":13,"cut":false,"hidden":false,"merged":[]}
["n_TreasureID","n_TreasureGrade","n_AppearRate","s_TreasureImg","f_LockRate","f_TreasureMimicRate","n_BattleMonsterID","n_TreasureRewardID","n_DestroyRewardID"]
["_상자 ID","상자 등급","보물 상자 등장 가중치","보물 상자 이미지","잠김 상태 등장 확률 (100 = 100%)","미믹 등장 확률 (100=100%)","전투 변환 몬스터 ID","보상 랜덤백 ID","실패 보상 랜덤백 ID"]
[101,1,1000,"treasure_lock",5,55,14018,91001,90001]
[102,1,1000,"treasure_lock",15,55,14018,91002,90001]
[103,1,1000,"treasure_lock",30,55,14018,91003,90001]
[201,2,200,"treasure_lock",60,55,14018,91004,90001]
[202,2,200,"treasure_lock",100,55,14018,91005,90001]
[203,2,200,"treasure_lock",100,55,14018,91006,90001]
[301,3,0,"treasure_lock",100,55,14018,91007,90001]
[302,3,0,"treasure_lock",100,55,14018,91008,90001]
[303,3,0,"treasure_lock",100,55,14018,91009,90001]
[401,4,0,"treasure_lock",100,55,14018,91010,90001]
[501,5,0,"treasure_lock",100,55,14018,91011,90001]

{"sheet":"NPCConfig","index":6,"n_rows":11,"n_cols":16,"rows_kept":11,"cut":false,"hidden":false,"merged":[]}
["n_NPCID","n_NPCGrade","s_NPCImg","n_AppearRate","n_BattleMonsterID","e_NPCType","n_NPC​RequestItemID","n_NPCRewardID","n_AppearTalkID","n_BattleTalkID","n_LeaveTalkID","n_NPC​RequestItemTalkID","n_NPCGiftTalkID","n_NoGiftTalkID","n_StealFailTalkID","n_DieTalkID"]
["_NPC ID","NPC 등급","NPC 이미지","NPC 등장 가중치","전투 변환 몬스터 ID","NPC 성향","NPC 요구 아이템 랜덤백 ID","NPC 랜덤 보상 랜덤백 ID","등장 대화 패턴","전투 대화 패턴","NPC 떠날 때 대화 패턴","NPC 선물 감사 대화 패턴","NPC 선물 감사 대화 패턴","NPC 선물 거절 대화 패턴","NPC 훔치기 실패 대화 패턴","NPC 죽음 대화 패턴"]
[101,1,"Npc_05",500,12015,"Good",90002,90003,501010,{"$f":"I3+10","v":501020},{"$f":"J3+10","v":501030},501040,501050,501060,501070,501080]
[102,1,"Npc_05",400,12015,"Neutral",90002,90003,{"$f":"I3+1000","v":502010},{"$f":"I4+10","v":502020},{"$f":"J4+10","v":502030},502040,502050,502060,502070,502080]
[103,1,"Npc_05",100,12015,"Evil",90002,90003,{"$f":"I4+1000","v":503010},{"$f":"I5+10","v":503020},503030,503040,503050,503060,503070,503080]
[201,2,"Npc_05",50,12015,"Good",90002,90003,504010,{"$f":"I6+10","v":504020},504030,504040,504050,504060,504070,504080]
[202,2,"Npc_05",40,12015,"Neutral",90002,90003,505010,{"$f":"I7+10","v":505020},505030,505040,505050,505060,505070,505080]
[203,2,"Npc_05",10,12015,"Evil",90002,90003,506010,{"$f":"I8+10","v":506020},506030,506040,506050,506060,506070,506080]
[301,3,"Npc_05",0,12015,"Good",90002,90003,507010,{"$f":"I9+10","v":507020},507030,507040,507050,507060,507070,507080]
[302,3,"Npc_05",0,12015,"Neutral",90002,90003,508010,{"$f":"I10+10","v":508020},508030,508040,508050,508060,508070,508080]
[303,3,"Npc_05",0,12015,"Evil",90002,90003,509010,{"$f":"I11+10","v":509020},509030,509040,509050,509060,509070,509080]

{"sheet":"RewardRandomBag","index":7,"n_rows":22,"n_cols":8,"rows_kept":22,"cut":false,"hidden":false,"merged":[]}
["n_DropIndex","n_ItemGrade","e_ItemType","n_ItemId","n_DropRate","n_DropCountMin","n_DropCountMax","exception"]
["_랜덤백 그룹 ID","아이템 등급","아이템 타입","아이템 ID","드랍 비중","드랍 최소 수량","드랍 최대 수량","참고용 텍스트"]
[90001,1,"Goods",201,75,1,1]
[90001,1,"Goods",201,20,2,2]
[90001,1,"Goods",201,5,3,3]
[90002,1,"Goods",401,75,1,1]
[90002,1,"Goods",401,20,2,2]
[90002,1,"Goods",401,5,3,3]
[90003,1,"Goods",201,75,100,100]
[90003,1,"Goods",201,20,200,200]
[90003,1,"Goods",201,5,300,300]
[90004,1,"Goods",201,75,50,50]
[90004,1,"Goods",201,20,60,60]
[90004,1,"Goods",201,5,70,70]
[90005,1,"Goods",201,75,150,150]
[90005,1,"Goods",201,20,250,250]
[90005,1,"Goods",201,5,350,350]
[{"$f":"A3+1000","v":91001},1,"Goods",201,75,500,500]
[{"$f":"A6+1000","v":91002},1,"Goods",201,75,550,550]
[{"$f":"A9+1000","v":91003},1,"Goods",201,75,600,600]
[{"$f":"A13+1000","v":91004},1,"Goods",201,20,777,777]
[{"$f":"A17+1000","v":91005},1,"Goods",201,5,888,888]

{"sheet":"MerchantConfig","index":8,"n_rows":11,"n_cols":16,"rows_kept":11,"cut":false,"hidden":false,"merged":[]}
["n_MerchantID","n_MerchantGrade","s_MerchantImg","n_AppearRate","n_BattleMonsterID","n_ProductRandomBagID","f_MerchantSaleMin","f_MerchantSaleMax","n_AppearTalkID","n_BattleTalkID","n_LeaveTalkID","n_SalesTalkID","n_SoldOutTalkID","n_NoPurchaseTalkID","n_StealFailTalkID","n_DieTalkID"]
["_상인 ID","상인 등급","_상인 이미지","상인 등장 가중치","전투 변환 몬스터 ID","판매할 상품 ID","최소 할인율(기본 할인율)","최대 할인율","등장 대화 패턴","전투 대화 패턴","상인 떠날 때 대화 패턴","상품 판매 중 대화 패턴","상품 구입 시 대화 패턴","상품 구입 안함 대화 패턴","훔치기 실패 대화 패턴","상인 죽음 대화 패턴"]
[101,1,"Trader_01",100,12014,90002,30,70,601010,{"$f":"I3+10","v":601020},{"$f":"J3+10","v":601030},601040,601050,601060,601070,601080]
[102,1,"Trader_01",100,12014,90002,30,70,{"$f":"I3+1000","v":602010},{"$f":"I4+10","v":602020},602030,602040,602050,602060,602070,602080]
[103,1,"Trader_01",100,12014,90002,30,70,{"$f":"I4+1000","v":603010},{"$f":"I5+10","v":603020},603030,603040,603050,603060,603070,603080]
[201,2,"Trader_01",0,12014,90002,30,70,604010,604020,604030,604040,604050,604060,604070,604080]
[202,2,"Trader_01",0,12014,90002,30,70,605010,605020,605030,605040,605050,605060,605070,605080]
[203,2,"Trader_01",0,12014,90002,30,70,606010,606020,606030,606040,606050,606060,606070,606080]
[301,3,"Trader_01",0,12014,90002,30,70,607010,607020,607030,607040,607050,607060,607070,607080]
[302,3,"Trader_01",0,12014,90002,30,70,608010,608020,608030,608040,608050,608060,608070,608080]
[303,3,"Trader_01",0,12014,90002,30,70,609010,609020,609030,609040,609050,609060,609070,609080]

{"sheet":"SanctuaryConfig","index":9,"n_rows":14,"n_cols":7,"rows_kept":14,"cut":false,"hidden":false,"merged":[]}
["s_SanctuaryType","e_SanctuaryType","s_MineImg","n_AppearRate","n_BuffDesc","n_BuffOptionID"]
["_맵툴 성소 표기 문구","성소 구분","성소 이미지","성소 등장 가중치","버프 효과 발생 시 등장 문구","버프 효과 ID"]
["회복의 성소","Sanctuary","sanctuary4",0,40001,22001,"즉시 모든 생명력과 보호막을 회복한다."]
["성장의 성소","Sanctuary","sanctuary7",0,40002,22002,"남은 경험치에 관계 없이 즉시 레벨 업을 한다."]
["부활의 성소","Sanctuary","sanctuary0",0,40003,22003,"죽었을 경우 부활 할 수 있는 버프가 1회 추가 된다."]
["스킬의 성소","Sanctuary","sanctuary3",0,40004,22004,"랜덤 스킬 1개를 즉시 획득한다. (※선택지 없음)"]
["지식의 성소","Sanctuary","sanctuary7",0,40005,22005,"획득 가능한 모든 경험치가 2배가 된다."]
["재물의 성소","Sanctuary","sanctuary2",0,40006,22006,"획득 가능한 모든 골드가 2배가 된다."]
["영혼의 성소","Sanctuary","sanctuary0",0,40007,22007,"즉시 영혼 재화를 랜덤 획득한다."]
["황금의 성소","Sanctuary","sanctuary6",0,40008,22008,"즉시 대량의 골드를 획득한다."]
["무적의 성소","Sanctuary","sanctuary0",0,40009,22009,"일정 시간 무적 상태가 된다."]
["치유의 샘","Spring_Heal","sanctuary4",100,40010,23001,"약간의 생명력을 회복한다."]
["경험의 샘","Spring_Exp","sanctuary10",100,40011,23002,"약간의 경험치를 획득한다."]
["보호의 샘","Spring_Shield","sanctuary11",100,40012,23003,"약간의 보호막이 회복된다."]

{"sheet":"RandomPatternConfig","index":10,"n_rows":6,"n_cols":18,"rows_kept":6,"cut":false,"hidden":false,"merged":[]}
["n_RandomPatternID","s_RandomPatternID","n_PatternRate","n_NothingRate","n_MonsterRate","n_MonsterLimitCount","n_BuffDebuffRate","n_BuffDebuffLimitCount","n_MerchantRate","n_MerchantLimitCount","n_TreasureRate","n_TreasureLimitCount","n_NPCRate","n_NPCLimitCount","n_MineRate","f_MineLimitCount","f_TwoWayRate","f_TwoWayLimitCount"]
["_랜덤 패턴 고유 ID","맵툴 표기 문구","패턴 발생 비중","없음 발생 비중","몬스터 발생 비중","최대 발생 제한 횟수","버프 패턴 발생 비중","최대 발생 제한 횟수","상인 패턴 발생 비중","최대 발생 제한 횟수","보물 상자 등장 비중","최대 발생 제한 횟수","NPC 발생 비중","최대 발생 제한 횟수","성소 발생 비중","최대 발생 비중","갈림길 발생 비중","최대 발생 제한 횟수"]
[1,"랜덤 (기본)",10000,6000,3000,30,200,2,30,1,40,1,30,1,500,1,200,1]
[2,"랜덤 (많은 상인)",0,8000,800,2,200,2,230,2,40,1,30,1,500,1,200,1]
[3,"랜덤 (많은 상자)",0,8000,800,1,200,2,30,1,240,2,30,1,500,1,200,1]
[4,"랜덤 (많은 몬스터)",0,7000,2000,3,200,0,30,1,40,1,30,1,500,1,200,1]

{"sheet":"WorldMapConfig","index":11,"n_rows":23,"n_cols":6,"rows_kept":23,"cut":false,"hidden":false,"merged":[]}
["n_StageID","n_StageName","s_StageDiorama","s_StageBg","s_StageBGM","n_ExtraRandombag"]
["_월드맵 장소 별 고유 ID","UI에 표기 될 장소 명칭","월드맵에 배치 될 디오라마 이미지","UI에 사용 될 BG 이미지","스테이지에 사용 될 BGM","이벤트에 사용 될 추가 전리품 랜덤백"]
[1,9001,null,"map_01",null,90005]
[2,9002,null,"map_02",null,90005]
[3,9003,null,"map_03",null,90005]
[4,9004,null,"map_04",null,90005]
[5,9005,null,"map_05",null,90005]
[6,9006,null,"map_06",null,90005]
[7,9007,null,"map_07",null,90005]
[8,9008,null,"map_08",null,90005]
[9,9009,null,"map_09",null,90005]
[10,9010,null,"map_10",null,90005]
[11,9011,null,"map_01",null,90005]
[12,9012,null,"map_02",null,90005]
[13,9013,null,"map_03",null,90005]
[14,9014,null,"map_04",null,90005]
[15,9015,null,"map_05",null,90005]
[16,9016,null,"map_06",null,90005]
[17,9017,null,"map_07",null,90005]
[18,9018,null,"map_08",null,90005]
[19,9019,null,"map_09",null,90005]
[20,9020,null,"map_10",null,90005]
[21,9021,null,"map_01",null,90005]

{"sheet":"ApprearMonsterPattern","index":12,"n_rows":727,"n_cols":14,"rows_kept":727,"cut":false,"hidden":false,"merged":[]}
["n_AppearMonserGroup","n_MonsterID","n_AppearRate"]
["_월드맵 장소 별 고유 ID","등장 몬스터 ID","등장 몬스터 가중치",null,"몬스터 이름","몬스터 타입","LV 컨셉",null,null,"ID","몬스터 이름","타입","LV"]
[10101,14001,100,null,"놀1","수인형 몬스터",1,null,null,11001,"놀1","수인형 몬스터",1,{"$f":"_xlfn.TEXTJOIN(\",\",TRUE,_xlfn.UNIQUE(_xlfn._xlws.FILTER($B$3:$B$100,$A$3:$A$100=A6,\"\")))","v":"14001,14013,14014,11007"}]
[10101,14002,100,null,"놀2","수인형 몬스터",1,null,null,11002,"놀2","수인형 몬스터",1]
[10101,14013,100,null,"놀아처2","수인형 몬스터",1,null,null,11007,"놀아처2","수인형 몬스터",1]
[10102,14001,100,null,"펑거스","마법 생물",1,null,null,14001,"펑거스","마법 생물",1]
[10102,14013,100,null,"동굴 박쥐","마법 생물",1,null,null,14002,"동굴 박쥐","마법 생물",1]
[10102,14014,100,null,"동굴쥐1","마법 생물",1,null,null,14013,"동굴쥐1","마법 생물",1]
[10102,11007,100,null,"미믹","마법 생물",1,null,null,14018,"미믹","마법 생물",1]
[10103,14014,100,null,"놀3","수인형 몬스터",2,null,null,11003,"놀3","수인형 몬스터",2]
[10103,11001,100,null,"놀강도3","수인형 몬스터",2,null,null,11005,"놀강도3","수인형 몬스터",2]
[10103,11002,100,null,"만드레고라","마법 생물",2,1,null,14003,"만드레고라","마법 생물",2]
[10103,11007,100,null,"맹독사2","마법 생물",2,null,null,14017,"맹독사2","마법 생물",2]
[10104,11001,100,null,"슬라임1","마법 생물",2,null,null,14021,"슬라임1","마법 생물",2]
[10104,11002,100,null,"임프2","마법 생물",2,null,null,14024,"임프2","마법 생물",2]
[10104,11007,100,null,"놀아처3","수인형 몬스터",3,null,null,11008,"놀아처3","수인형 몬스터",3]
[10104,14003,100,null,"미노타우로스 도살자1","수인형 몬스터",3,null,null,11013,"미노타우로스 도살자1","수인형 몬스터",3]
[10104,11003,100,null,"트롤2","수인형 몬스터",3,null,null,11030,"트롤2","수인형 몬스터",3]
[10201,11001,100,null,"트롤3","수인형 몬스터",3,null,null,11031,"트롤3","수인형 몬스터",3]
[10201,11002,100,null,"동굴쥐2","마법 생물",3,null,null,14014,"동굴쥐2","마법 생물",3]
[10201,11003,100,null,"슬라임2","마법 생물",3,null,null,14022,"슬라임2","마법 생물",3]
[10201,11005,100,null,"미노타우르스 광전사1","수인형 몬스터",4,null,null,11009,"미노타우르스 광전사1","수인형 몬스터",4]
[10201,11008,100,null,"싸이클롭스2","수인형 몬스터",4,null,null,11025,"싸이클롭스2","수인형 몬스터",4]
[10202,14003,100,null,"놀강도4","수인형 몬스터",5,null,null,11006,"놀강도4","수인형 몬스터",5]
[10202,14024,100,null,"트롤1","수인형 몬스터",5,null,null,11029,"트롤1","수인형 몬스터",5]
[10202,14013,100,null,"오크 궁수1","인간형 몬스터",5,null,null,12028,"오크 궁수1","인간형 몬스터",5]
[10202,14014,100,null,"오크1","인간형 몬스터",5,null,null,12032,"오크1","인간형 몬스터",5]
[10203,14021,100,null,"사악한 악령1","언데드형 몬스터",5,null,null,13014,"사악한 악령1","언데드형 몬스터",5]
[10203,14022,100,null,"놀강도1","수인형 몬스터",6,null,null,11004,"놀강도1","수인형 몬스터",6]
[10203,14017,100,null,"오크 마법사2","인간형 몬스터",6,null,null,12031,"오크 마법사2","인간형 몬스터",6]
[10203,14002,100,null,"오크2","인간형 몬스터",6,2,null,12033,"오크2","인간형 몬스터",6]
[10203,14003,100,null,"데스웜","마법 생물",6,null,null,14012,"데스웜","마법 생물",6]
[10204,11030,100,null,"싸이클롭스1","수인형 몬스터",7,null,null,11024,"싸이클롭스1","수인형 몬스터",7]
[10204,11031,100,null,"오크 궁수2","인간형 몬스터",7,null,null,12029,"오크 궁수2","인간형 몬스터",7]
[10204,11005,100,null,"오크 마법사1","인간형 몬스터",7,null,null,12030,"오크 마법사1","인간형 몬스터",7]
[10204,11008,100,null,"미노타우르스 광전사4","수인형 몬스터",8,null,null,11012,"미노타우르스 광전사4","수인형 몬스터",8]
[10204,14024,100,null,"미노타우로스 도살자2","수인형 몬스터",8,null,null,11014,"미노타우로스 도살자2","수인형 몬스터",8]
[10205,11013,100,null,"미노타우르스 챔피언4","수인형 몬스터",8,null,null,11018,"미노타우르스 챔피언4","수인형 몬스터",8]
[10205,14024,100,null,"미노타우르스 챔피언5","수인형 몬스터",8,null,null,11019,"미노타우르스 챔피언5","수인형 몬스터",8]
[10205,14021,100,null,"활든 강도2","인간형 몬스터",8,null,null,12036,"활든 강도2","인간형 몬스터",8]
[10205,14002,100,null,"버그베어2","수인형 몬스터",9,null,null,11021,"버그베어2","수인형 몬스터",9]
[10205,14017,100,null,"버그베어3","수인형 몬스터",9,null,null,11022,"버그베어3","수인형 몬스터",9]
[10205,14001,100,null,"버그베어4","수인형 몬스터",9,null,null,11023,"버그베어4","수인형 몬스터",9]
[10206,14022,100,null,"다크엘프 마법사1","인간형 몬스터",9,null,null,12017,"다크엘프 마법사1","인간형 몬스터",9]
[10206,11013,100,null,"연쇄살인마1","인간형 몬스터",9,null,null,12025,"연쇄살인마1","인간형 몬스터",9]
[10206,11030,100,null,"미노타우르스 광전사2","수인형 몬스터",10,null,null,11010,"미노타우르스 광전사2","수인형 몬스터",10]
[10206,11031,100,null,"미노타우르스 광전사3","수인형 몬스터",10,null,null,11011,"미노타우르스 광전사3","수인형 몬스터",10]
[10206,11008,100,null,"살인 청부업자3","인간형 몬스터",10,3,null,12024,"살인 청부업자3","인간형 몬스터",10]
[20301,11006,100,null,"활든 강도3","인간형 몬스터",10,null,null,12037,"활든 강도3","인간형 몬스터",10]
[20301,12032,100,null,"미노타우르스 챔피언3","수인형 몬스터",11,null,null,11017,"미노타우르스 챔피언3","수인형 몬스터",11]
[20301,12028,100,null,"광전사6","인간형 몬스터",11,null,null,12013,"광전사6","인간형 몬스터",11]
[20301,14012,100,null,"살인 청부업자2","인간형 몬스터",11,null,null,12023,"살인 청부업자2","인간형 몬스터",11]
[20302,12032,100,null,"연쇄살인마3","인간형 몬스터",11,null,null,12027,"연쇄살인마3","인간형 몬스터",11]
[20302,12033,100,null,"악마 광신자2","언데드형 몬스터",11,null,null,13017,"악마 광신자2","언데드형 몬스터",11]
[20302,12029,100,null,"고블린1","인간형 몬스터",12,null,null,12004,"고블린1","인간형 몬스터",12]
[20302,11006,100,null,"고블린 라이더1","인간형 몬스터",12,null,null,12005,"고블린 라이더1","인간형 몬스터",12]
[20303,12032,100,null,"고블린 라이더2","인간형 몬스터",12,null,null,12006,"고블린 라이더2","인간형 몬스터",12]
[20303,12033,100,null,"고블린 아처1","인간형 몬스터",12,null,null,12007,"고블린 아처1","인간형 몬스터",12]
[20303,12030,100,null,"네크로멘서1","언데드형 몬스터",13,null,null,13001,"네크로멘서1","언데드형 몬스터",13]
[20303,12031,100,null,"데스1","언데드형 몬스터",13,null,null,13004,"데스1","언데드형 몬스터",13]
[20303,12036,100,null,"머미1","언데드형 몬스터",13,null,null,13007,"머미1","언데드형 몬스터",13]
[20304,12033,100,null,"사악한 악령2","언데드형 몬스터",13,null,null,13015,"사악한 악령2","언데드형 몬스터",13]
[20304,12028,100,null,"임프 사역마1","언데드형 몬스터",13,null,null,13023,"임프 사역마1","언데드형 몬스터",13]
[20304,12029,100,null,"네크로멘서2","언데드형 몬스터",14,null,null,13002,"네크로멘서2","언데드형 몬스터",14]
[20304,11006,100,null,"데스2","언데드형 몬스터",14,null,null,13005,"데스2","언데드형 몬스터",14]
[20304,13014,100,null,"머미2","언데드형 몬스터",14,null,null,13008,"머미2","언데드형 몬스터",14]
[20305,12036,100,null,"타락한 기사2","언데드형 몬스터",14,4,null,13026,"타락한 기사2","언데드형 몬스터",14]
[20305,13014,100,null,"광전사1","인간형 몬스터",15,null,null,12008,"광전사1","인간형 몬스터",15]
[20305,14012,100,null,"광전사3","인간형 몬스터",15,null,null,12010,"광전사3","인간형 몬스터",15]
[20305,11009,100,null,"광전사5","인간형 몬스터",15,null,null,12012,"광전사5","인간형 몬스터",15]
[20305,11014,100,null,"네크로멘서3","언데드형 몬스터",15,null,null,13003,"네크로멘서3","언데드형 몬스터",15]
[20401,11009,100,null,"악마 광신자4","언데드형 몬스터",15,null,null,13019,"악마 광신자4","언데드형 몬스터",15]
[20401,12029,100,null,"싸이클롭스3","수인형 몬스터",16,null,null,11026,"싸이클롭스3","수인형 몬스터",16]
[20401,12030,100,null,"해골 궁수","언데드형 몬스터",16,null,null,13028,"해골 궁수","언데드형 몬스터",16]
[20401,12031,100,null,"해골 근위병","언데드형 몬스터",16,null,null,13029,"해골 근위병","언데드형 몬스터",16]
[20401,11029,100,null,"해골 기사1","언데드형 몬스터",16,null,null,13031,"해골 기사1","언데드형 몬스터",16]
[20402,12036,100,null,"임프 마법사1","마법 생물",16,null,null,14027,"임프 마법사1","마법 생물",16]
[20402,14012,100,null,"예티1","수인형 몬스터",17,null,null,11027,"예티1","수인형 몬스터",17]
[20402,13014,100,null,"예티2","수인형 몬스터",17,null,null,11028,"예티2","수인형 몬스터",17]
[20402,11014,100,null,"다크엘프 마법사4","인간형 몬스터",17,null,null,12019,"다크엘프 마법사4","인간형 몬스터",17]
[20402,11024,100,null,"도살자1","인간형 몬스터",17,null,null,12020,"도살자1","인간형 몬스터",17]
[20403,11029,100,null,"임프 사역마2","언데드형 몬스터",17,null,null,13024,"임프 사역마2","언데드형 몬스터",17]
[20403,11018,100,null,"도살자2","인간형 몬스터",18,null,null,12021,"도살자2","인간형 몬스터",18]
[20403,11009,100,null,"살인 청부업자1","인간형 몬스터",18,null,null,12022,"살인 청부업자1","인간형 몬스터",18]
[20403,12030,100,null,"타락한 기사1","언데드형 몬스터",18,null,null,13025,"타락한 기사1","언데드형 몬스터",18]
[20403,11024,100,null,"구울1","마법 생물",18,null,null,14007,"구울1","마법 생물",18]
[20404,11012,100,null,"구울2","마법 생물",19,null,null,14008,"구울2","마법 생물",19]
[20404,11018,100,null,"구울3","마법 생물",19,5,null,14009,"구울3","마법 생물",19]
[20404,11019,100,null,"다이어울프1","마법 생물",19,null,null,14010,"다이어울프1","마법 생물",19]
[20404,11025,100,null,"다이어울프2","마법 생물",19,null,null,14011,"다이어울프2","마법 생물",19]
[20404,12028,100,null,"임프 마법사3","마법 생물",19,null,null,14029,"임프 마법사3","마법 생물",19]
[20404,12029,100,null,"임프 전사3","마법 생물",19,null,null,14032,"임프 전사3","마법 생물",19]
[20405,11012,100,null,"임프1","마법 생물",20,null,null,14023,"임프1","마법 생물",20]
[20405,11029,100,null,"임프3","마법 생물",20,null,null,14025,"임프3","마법 생물",20]
[20405,11018,100,null,"임프 마법사4","마법 생물",20,null,null,14030,"임프 마법사4","마법 생물",20]
[20405,11019,100,null,"임프 전사2","마법 생물",20,null,null,14031,"임프 전사2","마법 생물",20]
[20405,12031,100,null,"흡혈귀1","마법 생물",20,null,null,14034,"흡혈귀1","마법 생물",20]
[20406,11014,100,null,"해골 기사2","언데드형 몬스터",21,null,null,13032,"해골 기사2","언데드형 몬스터",21]
[20406,11012,100,null,"강도1","인간형 몬스터",22,null,null,12001,"강도1","인간형 몬스터",22]
[20406,12028,100,null,"강도2","인간형 몬스터",22,null,null,12002,"강도2","인간형 몬스터",22]
[20406,11024,100,null,"강도3","인간형 몬스터",22,null,null,12003,"강도3","인간형 몬스터",22]
[20406,11025,100,null,"연쇄살인마2","인간형 몬스터",22,null,null,12026,"연쇄살인마2","인간형 몬스터",22]
[20406,11029,100,null,"악마 추종자1","언데드형 몬스터",22,null,null,13020,"악마 추종자1","언데드형 몬스터",22]
[20407,11018,100,null,"해골 법사","언데드형 몬스터",22,null,null,13030,"해골 법사","언데드형 몬스터",22]
[20407,11019,100,null,"해골 기사3","언데드형 몬스터",22,null,null,13033,"해골 기사3","언데드형 몬스터",22]
[20407,11024,100,null,"해골 기사4","언데드형 몬스터",22,null,null,13034,"해골 기사4","언데드형 몬스터",22]
[20407,11025,100,null,"미노타우르스 챔피언1","수인형 몬스터",23,null,null,11015,"미노타우르스 챔피언1","수인형 몬스터",23]
[20407,12031,100,null,"미노타우르스 챔피언2","수인형 몬스터",23,null,null,11016,"미노타우르스 챔피언2","수인형 몬스터",23]
[20407,12030,100,null,"다크엘프 기사4","인간형 몬스터",23,null,null,12016,"다크엘프 기사4","인간형 몬스터",23]
[30501,12004,100,null,"데스나이트2","언데드형 몬스터",23,6,null,13006,"데스나이트2","언데드형 몬스터",23]
[30501,12007,100,null,"악마 광신자3","언데드형 몬스터",23,null,null,13018,"악마 광신자3","언데드형 몬스터",23]
[30501,12024,100,null,"무리안","마법 생물",23,null,null,14005,"무리안","마법 생물",23]
[30501,12013,100,null,"버그베어1","수인형 몬스터",24,null,null,11020,"버그베어1","수인형 몬스터",24]
[30501,12006,100,null,"광전사2","인간형 몬스터",24,null,null,12009,"광전사2","인간형 몬스터",24]
[30502,12004,100,null,"광전사4","인간형 몬스터",24,null,null,12011,"광전사4","인간형 몬스터",24]
[30502,12005,100,null,"다크엘프 마법사3","인간형 몬스터",24,null,null,12018,"다크엘프 마법사3","인간형 몬스터",24]
[30502,12007,100,null,"오크 워리어1","인간형 몬스터",24,null,null,12034,"오크 워리어1","인간형 몬스터",24]
[30502,12006,100,null,"활든 강도1","인간형 몬스터",24,null,null,12035,"활든 강도1","인간형 몬스터",24]
[30503,12013,100,null,"다크엘프 기사2","인간형 몬스터",25,null,null,12014,"다크엘프 기사2","인간형 몬스터",25]
[30503,12024,100,null,"다크엘프 기사3","인간형 몬스터",25,null,null,12015,"다크엘프 기사3","인간형 몬스터",25]
[30503,12023,100,null,"머미3","언데드형 몬스터",25,null,null,13009,"머미3","언데드형 몬스터",25]
[30503,13017,100,null,"바포메트1","언데드형 몬스터",25,null,null,13010,"바포메트1","언데드형 몬스터",25]
[30503,12027,100,null,"맹독사1","마법 생물",25,null,null,14016,"맹독사1","마법 생물",25]
[30504,12004,100,null,"스프리트","마법 생물",25,null,null,14020,"스프리트","마법 생물",25]
[30504,12005,100,null,"바포메트4","언데드형 몬스터",26,null,null,13012,"바포메트4","언데드형 몬스터",26]
[30504,12007,100,null,"악마 추종자2","언데드형 몬스터",26,null,null,13021,"악마 추종자2","언데드형 몬스터",26]
[30504,12027,100,null,"악마 추종자3","언데드형 몬스터",26,null,null,13022,"악마 추종자3","언데드형 몬스터",26]
[30504,12025,100,null,"타락한 기사3","언데드형 몬스터",26,null,null,13027,"타락한 기사3","언데드형 몬스터",26]
[30505,12004,100,null,"임프4","마법 생물",26,null,null,14026,"임프4","마법 생물",26]
[30505,12006,100,null,"켄타우로스","마법 생물",27,null,null,14004,"켄타우로스","마법 생물",27]
[30505,12037,100,null,"타이가","마법 생물",27,null,null,14006,"타이가","마법 생물",27]
[30505,13017,100,null,"리자드맨","마법 생물",27,null,null,14015,"리자드맨","마법 생물",27]
[30505,12013,100,null,"셀로브","마법 생물",27,7,null,14019,"셀로브","마법 생물",27]
[30506,12037,100,null,"레드드래곤1","거인 종족",27,null,null,15002,"레드드래곤1","거인 종족",27]
[30506,12023,100,null,"오우거3","거인 종족",27,null,null,15012,"오우거3","거인 종족",27]
[30506,12025,100,null,"임프 마법사2","마법 생물",28,null,null,14028,"임프 마법사2","마법 생물",28]
[30506,12024,100,null,"하피","마법 생물",28,null,null,14033,"하피","마법 생물",28]
[30506,12027,100,null,"싸이 전사","거인 종족",29,null,null,15001,"싸이 전사","거인 종족",28]
[30601,12005,100,null,"약탈꾼2","거인 종족",29,null,null,15005,"약탈꾼2","거인 종족",28]
[30601,12007,100,null,"예티6","거인 종족",29,null,null,15010,"예티6","거인 종족",28]
[30601,12006,100,null,"트롤 워리어2","거인 종족",29,null,null,15015,"트롤 워리어2","거인 종족",28]
[30601,13017,100,null,"악마 광신자1","언데드형 몬스터",30,null,null,13016,"악마 광신자1","언데드형 몬스터",29]
[30601,12023,100,null,"용암골렘1","거인 종족",30,null,null,15013,"용암골렘1","거인 종족",29]
[30602,11010,100,null,"트롤 워리어1","거인 종족",30,null,null,15014,"트롤 워리어1","거인 종족",29]
[30602,12013,100,null,"트롤 워리어3","거인 종족",30,null,null,15016,"트롤 워리어3","거인 종족",29]
[30602,12017,100,null,"트롤 워리어5","거인 종족",30,null,null,15017,"트롤 워리어5","거인 종족",29]
[30602,12024,100,null,"바포메트5","언데드형 몬스터",31,null,null,13013,"바포메트5","언데드형 몬스터",30]
[30602,12007,100,null,"약탈꾼1","거인 종족",31,null,null,15004,"약탈꾼1","거인 종족",30]
[30603,11017,100,null,"예티1","거인 종족",31,null,null,15006,"예티1","거인 종족",30]
[30603,11021,100,null,"예티3","거인 종족",31,null,null,15008,"예티3","거인 종족",30]
[30603,11011,100,null,"예티5","거인 종족",31,8,null,15009,"예티5","거인 종족",30]
[30603,12027,100,null,"오우거2","거인 종족",32,null,null,15011,"오우거2","거인 종족",30]
[30603,12017,100,null,"바포메트3","언데드형 몬스터",32,null,null,13011,"바포메트3","언데드형 몬스터",31]
[30603,12025,100,null,"레드드래곤2","거인 종족",32,null,null,15003,"레드드래곤2","거인 종족",31]
[30604,11023,100,null,"예티2","거인 종족",32,null,null,15007,"예티2","거인 종족",31]
[30604,11010,100,null,"트롤 워리어6","거인 종족",32,null,null,15018,"트롤 워리어6","거인 종족",31]
[30604,11011,100,null,"트롤 워리어7","거인 종족",32,null,null,15019,"트롤 워리어7","거인 종족",31]
[30604,12037,100,null,"놀아처1","보스 몬스터",1]
[30604,12017,100,null,"놀강도2","보스 몬스터",2]
[30605,11021,100,null,"임프전사1","보스 몬스터",3]
[30605,11022,100,null,"오우거1","보스 몬스터",4]
[30605,12017,100,null,"바포메트6","보스 몬스터",5]
[30605,11017,100,null,"거미여왕2","보스 몬스터",6]
[30605,12037,100,null,"흑기사2","보스 몬스터",7]
[30605,13017,100,null,"늑대인간","보스 몬스터",8]
[30606,12025,100,null,"대사탄1","보스 몬스터",9]
[30606,12023,100,null,"다크엘프 아처1","보스 몬스터",10]
[30606,11023,100,null,"대사탄2","보스 몬스터",11]
[30606,11010,100,null,"데스나이트3","보스 몬스터",12]
[30606,11011,100,null,"메두사1","보스 몬스터",13]
[30606,11022,100,null,"바포메트2","보스 몬스터",14]
[30607,11017,100,null,"트롤 워리어4","보스 몬스터",15]
[30607,11021,100,null,"흑기사3","보스 몬스터",16]
[30607,11022,100,null,"흡혈귀여왕2","보스 몬스터",17]
[30607,11023,100,null,"에티4","보스 몬스터",18]
[30607,13017,100,null,"레드드래곤3","보스 몬스터",19]
[30607,12017,100,null,"메두사2","보스 몬스터",20]
[40701,13004,100,null,"흑기사1","보스 몬스터",21]
[40701,13028,100,null,"용암골렘2","보스 몬스터",22]
[40701,13029,100,null,"레드드래곤1","보스 몬스터",23]
[40701,12008,100,null,"바포메트7","보스 몬스터",24]
[40702,13004,100,null,"거미여왕1","보스 몬스터",25]
[40702,13028,100,null,"데스나이트1","보스 몬스터",26]
[40702,13029,100,null,"레드드래곤4","보스 몬스터",27]
[40702,13015,100,null,"타락한 천사","보스 몬스터",28]
[40703,13005,100,null,"타락한 천사","보스 몬스터",29]
[40703,13031,100,null,"타락한 천사","보스 몬스터",30]
[40703,13015,100,null,"타락한 천사","보스 몬스터",31]
[40703,13026,100,null,"타락한 천사","보스 몬스터",32]
[40704,13005,100]
[40704,13029,100]
[40704,13031,100]
[40704,13023,100]
[40704,13019,100]
[40801,13007,100]
[40801,13008,100]
[40801,13001,100]
[40801,13002,100]
[40801,13019,100]
[40802,13007,100]
[40802,13008,100]
[40802,13028,100]
[40802,13002,100]
[40802,13001,100]
[40803,13008,100]
[40803,13001,100]
[40803,13002,100]
[40803,13015,100]
[40803,13023,100]
[40803,13019,100]
[40804,13019,100]
[40804,13029,100]
[40804,13026,100]
[40804,13001,100]
[40804,13007,100]
[40804,13028,100]
[40805,13007,100]
[40805,13008,100]
[40805,13002,100]
[40805,13023,100]
[40805,13004,100]
[40805,13005,100]
[40901,12008,100]
[40901,13029,100]
[40901,13023,100]
[40901,13031,100]
[40901,12012,100]
[40902,12010,100]
[40902,12008,100]
[40902,13015,100]
[40902,13031,100]
[40902,13002,100]
[40902,13026,100]
[40902,12012,100]
[40903,13004,100]
[40903,13005,100]
[40903,12010,100]
[40903,13007,100]
[40903,13023,100]
[40903,12008,100]
[40904,13026,100]
[40904,12012,100]
[40904,11026,100]
[40904,13028,100]
[40904,13008,100]
[40904,13015,100]
[40904,12010,100]
[40905,11026,100]
[40905,13019,100]
[40905,12008,100]
[40905,12010,100]
[40905,12012,100]
[40905,13005,100]
[40906,11026,100]
[40906,13031,100]
[40906,13030,100]
[40906,13026,100]
[40906,13001,100]
[40906,12012,100]
[40906,13004,100]
[51001,14023,100]
[51001,14025,100]
[51001,14030,100]
[51001,14010,100]
[51001,14023,100]
[51002,14007,100]
[51002,14010,100]
[51002,14011,100]
[51002,14029,100]
[51002,14023,100]
[51003,14011,100]
[51003,13024,100]
[51003,14029,100]
[51003,14031,100]
[51003,14007,100]
[51004,14011,100]
[51004,14023,100]
[51004,13024,100]
[51004,14008,100]
[51004,14032,100]
[51004,14031,100]
[51005,14011,100]
[51005,14032,100]
[51005,14029,100]
[51005,14030,100]
[51005,14031,100]
[51005,14025,100]
[51101,14007,100]
[51101,14008,100]
[51101,14009,100]
[51101,14025,100]
[51101,12022,100]
[51101,14030,100]
[51102,14008,100]
[51102,12020,100]
[51102,12022,100]
[51102,14025,100]
[51102,13024,100]
[51102,14010,100]
[51103,13024,100]
[51103,14034,100]
[51103,14032,100]
[51103,12022,100]
[51103,12021,100]
[51103,14029,100]
[51104,14032,100]
[51104,12022,100]
[51104,12021,100]
[51104,14030,100]
[51104,14010,100]
[51105,14031,100]
[51105,14034,100]
[51105,12019,100]
[51105,14023,100]
[51105,14025,100]
[51105,13025,100]
[51201,11027,100]
[51201,12019,100]
[51201,14034,100]
[51201,12020,100]
[51201,14010,100]
[51201,14011,100]
[51202,14007,100]
[51202,14008,100]
[51202,14009,100]
[51202,12019,100]
[51202,14032,100]
[51202,12021,100]
[51202,13025,100]
[51203,14034,100]
[51203,11027,100]
[51203,11028,100]
[51203,14031,100]
[51203,12020,100]
[51203,12023,100]
[51203,12022,100]
[51204,13025,100]
[51204,14009,100]
[51204,11028,100]
[51204,13024,100]
[51204,12021,100]
[51204,12020,100]
[51205,11027,100]
[51205,11028,100]
[51205,13025,100]
[51205,14009,100]
[51205,12019,100]
[51205,12020,100]
[51205,12021,100]
[51206,11027,100]
[51206,11028,100]
[51206,14029,100]
[51206,14034,100]
[51206,13025,100]
[51206,14008,100]
[51206,12023,100]
[51207,11027,100]
[51207,11028,100]
[51207,14030,100]
[51207,14009,100]
[51207,12019,100]
[51207,14007,100]
[51207,12022,100]
[61301,12001,100]
[61301,12002,100]
[61301,12003,100]
[61301,12035,100]
[61301,13018,100]
[61301,12025,100]
[61301,14005,100]
[61302,12001,100]
[61302,12035,100]
[61302,13018,100]
[61302,12025,100]
[61302,12026,100]
[61302,13018,100]
[61302,12003,100]
[61303,12002,100]
[61303,12003,100]
[61303,12009,100]
[61303,13018,100]
[61303,12035,100]
[61303,12036,100]
[61303,12026,100]
[61304,13020,100]
[61304,12001,100]
[61304,12002,100]
[61304,12003,100]
[61304,12009,100]
[61304,12035,100]
[61304,12036,100]
[61401,12034,100]
[61401,13018,100]
[61401,13020,100]
[61401,12034,100]
[61401,12011,100]
[61401,12035,100]
[61401,12026,100]
[61402,13030,100]
[61402,13034,100]
[61402,13032,100]
[61402,13006,100]
[61402,12009,100]
[61402,12001,100]
[61402,12002,100]
[61403,13030,100]
[61403,13032,100]
[61403,12034,100]
[61403,13006,100]
[61403,11015,100]
[61403,11016,100]
[61403,13033,100]
[61403,12001,100]
[61404,13030,100]
[61404,13033,100]
[61404,13034,100]
[61404,13032,100]
[61404,13006,100]
[61404,13020,100]
[61404,14005,100]
[61404,12002,100]
[61405,13030,100]
[61405,13033,100]
[61405,13034,100]
[61405,13032,100]
[61405,13006,100]
[61405,14005,100]
[61405,12009,100]
[61405,13020,100]
[61501,12009,100]
[61501,12011,100]
[61501,12018,100]
[61501,12016,100]
[61501,11015,100]
[61501,12010,100]
[61501,11020,100]
[61501,13034,100]
[61502,12011,100]
[61502,12018,100]
[61502,12016,100]
[61502,13033,100]
[61502,13034,100]
[61502,11015,100]
[61502,11016,100]
[61502,11020,100]
[61503,12018,100]
[61503,12016,100]
[61503,11015,100]
[61503,11016,100]
[61503,11020,100]
[61503,12011,100]
[61503,12003,100]
[61504,13020,100]
[61504,12018,100]
[61504,12034,100]
[61504,11020,100]
[61504,11015,100]
[61504,11016,100]
[61504,14005,100]
[61504,12026,100]
[61505,12018,100]
[61505,12016,100]
[61505,12034,100]
[61505,11020,100]
[61505,14005,100]
[61505,12026,100]
[61505,11015,100]
[61505,11016,100]
[61601,13032,100]
[61601,13033,100]
[61601,13034,100]
[61601,13030,100]
[61601,12016,100]
[61601,12018,100]
[61602,13020,100]
[61602,12001,100]
[61602,12002,100]
[61602,12003,100]
[61602,12035,100]
[61602,12036,100]
[61603,11020,100]
[61603,13032,100]
[61603,12009,100]
[61603,12011,100]
[61603,14005,100]
[61603,13006,100]
[61603,12026,100]
[61603,13033,100]
[71701,12014,100]
[71701,12015,100]
[71701,14020,100]
[71701,13021,100]
[71701,13027,100]
[71701,14026,100]
[71701,14016,100]
[71702,14028,100]
[71702,14020,100]
[71702,13021,100]
[71702,13022,100]
[71702,13027,100]
[71702,14033,100]
[71702,15002,100]
[71702,13009,100]
[71703,14028,100]
[71703,14026,100]
[71703,12014,100]
[71703,13009,100]
[71703,13021,100]
[71703,13027,100]
[71703,14020,100]
[71704,15002,100]
[71704,14020,100]
[71704,13012,100]
[71704,13009,100]
[71704,14019,100]
[71704,14026,100]
[71704,13021,100]
[71704,13022,100]
[71705,12014,100]
[71705,12015,100]
[71705,13012,100]
[71705,14033,100]
[71705,13022,100]
[71705,13010,100]
[71705,14016,100]
[71706,13010,100]
[71706,14019,100]
[71706,13009,100]
[71706,13021,100]
[71706,13022,100]
[71706,14019,100]
[71706,14015,100]
[71706,14015,100]
[71707,13010,100]
[71707,14026,100]
[71707,14033,100]
[71707,15002,100]
[71707,12015,100]
[71707,12014,100]
[71707,14006,100]
[71708,14033,100]
[71708,13010,100]
[71708,14026,100]
[71708,14033,100]
[71708,15002,100]
[71708,13012,100]
[71708,15012,100]
[71708,14006,100]
[71708,14004,100]
[71801,14004,100]
[71801,12015,100]
[71801,13027,100]
[71801,14016,100]
[71801,14006,100]
[71801,15012,100]
[71801,13010,100]
[71801,14015,100]
[71802,14028,100]
[71802,14020,100]
[71802,13027,100]
[71802,14015,100]
[71802,15012,100]
[71802,14016,100]
[71802,14028,100]
[71803,14028,100]
[71803,14026,100]
[71803,14016,100]
[71803,13009,100]
[71803,13027,100]
[71803,14020,100]
[71803,14015,100]
[71803,14006,100]
[71803,12014,100]
[71804,15002,100]
[71804,14004,100]
[71804,13012,100]
[71804,14019,100]
[71804,14026,100]
[71804,13021,100]
[71804,14015,100]
[71804,14020,100]
[71805,12014,100]
[71805,12015,100]
[71805,13012,100]
[71805,13022,100]
[71805,14016,100]
[71805,14033,100]
[71805,15002,100]
[71805,15012,100]
[71806,14006,100]
[71806,15012,100]
[71806,14019,100]
[71806,13009,100]
[71806,13021,100]
[71806,13022,100]
[71806,14015,100]
[71806,14004,100]
[71806,13012,100]
[71807,14006,100]
[71807,15012,100]
[71807,13010,100]
[71807,12015,100]
[71807,12014,100]
[71807,14028,100]
[71807,14016,100]
[71807,14004,100]
[71808,14019,100]
[71808,13010,100]
[71808,14004,100]
[71808,15002,100]
[71808,13012,100]
[71808,15012,100]
[71808,14015,100]
[71808,14028,100]
[71808,14033,100]
[81901,15005,100]
[81901,15010,100]
[81901,14019,100]
[81901,15014,100]
[81901,13016,100]
[81901,15017,100]
[81902,15014,100]
[81902,15016,100]
[81902,15017,100]
[81902,15018,100]
[81902,15019,100]
[81902,13011,100]
[81903,13011,100]
[81903,15011,100]
[81903,15009,100]
[81903,15008,100]
[81903,13013,100]
[81904,15011,100]
[81904,15007,100]
[81904,15016,100]
[81904,15018,100]
[81904,15019,100]
[81904,13013,100]
[81905,15016,100]
[81905,15017,100]
[81905,15006,100]
[81905,15008,100]
[81905,15004,100]
[81906,15005,100]
[81906,15001,100]
[81906,15008,100]
[81906,15009,100]
[81906,13016,100]
[81906,13011,100]
[81907,13011,100]
[81907,13013,100]
[81907,15018,100]
[81907,15004,100]
[81907,15005,100]
[81908,15004,100]
[81908,15005,100]
[81908,15013,100]
[81908,15006,100]
[81908,15007,100]
[81909,15018,100]
[81909,15019,100]
[81909,13013,100]
[81909,15010,100]
[81909,15014,100]
[81909,15016,100]
[81909,13013,100]
[82001,15011,100]
[82001,15001,100]
[82001,15010,100]
[82001,13011,100]
[82001,15010,100]
[82002,15006,100]
[82002,15007,100]
[82002,15008,100]
[82002,15009,100]
[82002,13013,100]
[82003,15001,100]
[82003,15013,100]
[82003,15003,100]
[82003,13016,100]
[82003,15009,100]
[82004,15013,100]
[82004,15003,100]
[82004,13011,100]
[82005,15015,100]
[82005,15016,100]
[82005,15011,100]
[82005,13016,100]
[82005,15014,100]
[82006,15004,100]
[82006,15006,100]
[82006,15008,100]
[82006,15009,100]
[82006,15011,100]
[82006,13016,100]
[82007,15015,100]
[82007,15017,100]
[82007,13016,100]
[82007,15006,100]
[82008,15019,100]
[82008,15015,100]
[82008,15010,100]
[82008,15009,100]
[82008,15001,100]
[82008,15014,100]
[82009,15013,100]
[82009,15004,100]
[82009,15005,100]
[82009,15003,100]
[82101,15003,100]
[82101,13011,100]
[82101,13013,100]
[82102,15014,100]
[82102,15015,100]
[82102,15016,100]
[82102,15017,100]
[82102,15018,100]
[82102,15019,100]
[82102,13016,100]
[82103,15015,100]
[82103,15003,100]
[82103,15007,100]
[82103,15010,100]
[82103,15007,100]
[82103,15001,100]
[82103,15013,100]
[82104,15003,100]

{"sheet":"CreateMapConfig","index":13,"n_rows":124,"n_cols":44,"rows_kept":124,"cut":false,"hidden":false,"merged":[]}
["s_MapConfigID","n_StageType","n_AppearMonsterGroup","n_AppearBossGroup","f_Monster","n_MobNodeMin","n_MobNodeMax","exception","f_BuffDebuff","n_BuffDebuffMin","n_BuffDebuffMax","exception","f_CampFire","n_CampMin","n_CampMax","exception","f_Merchant","n_MerchantMin","n_MerchantMax","exception","f_Treasure","n_TreasureMin","n_TreasureMax","exception","f_NPC","n_NPCMin","n_NPCMax","exception","f_Mine","n_MineMin","n_MineMax","exception","f_TwoWay","n_TwoWayMin","n_TwoWayMax","exception","f_Nothing","n_NothingMin","n_NothingMax","exception","f_Random","n_RandomMin","n_RandomMax","exception"]
["_맵 고유 ID","스테이지 구분 ID","등장 몬스터 그룹 ID","등장 보스 몬스터 그룹 ID","몬스터 패턴 등장 확률","최소 개수","최대 개수","Data Border","버프/디버프 확률","최소 개수","최대 개수","Data Border","캠프 등장 확률","최소 개수","최대 개수","Data Border","암상인 등장 발생 확률","최소 개수","최대 개수","Data Border","보물 등장 발생 확률","보물 최소 개수","보물 최대 개수","Data Border","NPC 발생 확률","최소 개수","최대 개수","Data Border","성소 발생 확률","최소 개수","최대 개수","Data Border","갈림길 등장 확률","최소 개수","최대 개수","Data Border","없음 확률","없음 최소 개수","없음 최대 개수","Data Border","랜덤 발생 확률","랜덤 최소 개수","랜덤 최대 개수","Data Border"]
[{"$f":"\"Stage\"&B3&\"_\"&COUNTIF(B$3:B3,B3)","v":"Stage1_1"},1,10101,0,80,10,20,null,2.2999999999999998,0,1,null,16.2,0,1,null,1,0,1,null,1.5,0,1,null,3,0,1,null,5,0,1,null,1,0,1,null,1,1,10,null,20,5,99]
[{"$f":"\"Stage\"&B4&\"_\"&COUNTIF(B$3:B4,B4)","v":"Stage1_2"},1,{"$f":"10&MID(A4,6,1)&0&RIGHT(A4,1)","v":"10102"},10001,80,10,20,null,2.2999999999999998,0,1,null,16.2,0,1,null,1,0,1,null,1.5,0,1,null,3,0,1,null,5,0,1,null,1,0,1,null,1,1,10,null,20,5,99]
[{"$f":"\"Stage\"&B5&\"_\"&COUNTIF(B$3:B5,B5)","v":"Stage1_3"},1,{"$f":"10&MID(A5,6,1)&0&RIGHT(A5,1)","v":"10103"},0,80,10,20,null,2.2999999999999998,0,1,null,16.2,0,1,null,1,0,1,null,1.5,0,1,null,3,0,1,null,5,0,1,null,1,0,1,null,1,1,10,null,20,5,99]
[{"$f":"\"Stage\"&B6&\"_\"&COUNTIF(B$3:B6,B6)","v":"Stage1_4"},1,"10104",10002,80,10,20,null,2.2999999999999998,0,1,null,16.2,0,1,null,1,0,1,null,1.5,0,1,null,3,0,1,null,5,0,1,null,1,0,1,null,1,1,10,null,20,5,99]
[{"$f":"\"Stage\"&B7&\"_\"&COUNTIF(B$3:B7,B7)","v":"Stage2_1"},{"$f":"B4+1","v":2},"10201",10002,80,10,20,null,2.2999999999999998,0,1,null,16.2,0,1,null,1,0,1,null,1.5,0,1,null,3,0,1,null,5,0,1,null,1,0,1,null,1,1,10,null,20,5,99]
[{"$f":"\"Stage\"&B8&\"_\"&COUNTIF(B$3:B8,B8)","v":"Stage2_2"},{"$f":"B5+1","v":2},"10202",10003,80,10,20,null,2.2999999999999998,0,1,null,16.2,0,1,null,1,0,1,null,1.5,0,1,null,3,0,1,null,5,0,1,null,1,0,1,null,1,1,10,null,20,5,99]
[{"$f":"\"Stage\"&B9&\"_\"&COUNTIF(B$3:B9,B9)","v":"Stage2_3"},2,"10203",0,80,10,20,null,2.2999999999999998,0,1,null,16.2,0,1,null,1,0,1,null,1.5,0,1,null,3,0,1,null,5,0,1,null,1,0,1,null,1,1,10,null,20,5,99]
[{"$f":"\"Stage\"&B10&\"_\"&COUNTIF(B$3:B10,B10)","v":"Stage2_4"},2,"10204",10003,80,10,20,null,2.2999999999999998,0,1,null,16.2,0,1,null,1,0,1,null,1.5,0,1,null,3,0,1,null,5,0,1,null,1,0,1,null,1,1,10,null,20,5,99]
[{"$f":"\"Stage\"&B11&\"_\"&COUNTIF(B$3:B11,B11)","v":"Stage2_5"},2,"10205",10004,80,10,20,null,2.2999999999999998,0,1,null,16.2,0,1,null,1,0,1,null,1.5,0,1,null,3,0,1,null,5,0,1,null,1,0,1,null,1,1,10,null,20,5,99]
[{"$f":"\"Stage\"&B12&\"_\"&COUNTIF(B$3:B12,B12)","v":"Stage2_6"},2,"10206",10004,80,10,20,null,2.2999999999999998,0,1,null,16.2,0,1,null,1,0,1,null,1.5,0,1,null,3,0,1,null,5,0,1,null,1,0,1,null,1,1,10,null,20,5,99]
[{"$f":"\"Stage\"&B13&\"_\"&COUNTIF(B$3:B13,B13)","v":"Stage3_1"},3,{"$f":"20&MID(A13,6,1)&0&RIGHT(A13,1)","v":"20301"},10005,80,10,20,null,2.2999999999999998,0,1,null,16.2,0,1,null,1,0,1,null,1.5,0,1,null,3,0,1,null,5,0,1,null,1,0,1,null,1,1,10,null,20,5,99]
[{"$f":"\"Stage\"&B14&\"_\"&COUNTIF(B$3:B14,B14)","v":"Stage3_2"},3,{"$f":"20&MID(A14,6,1)&0&RIGHT(A14,1)","v":"20302"},0,80,10,20,null,2.2999999999999998,0,1,null,16.2,0,1,null,1,0,1,null,1.5,0,1,null,3,0,1,null,5,0,1,null,1,0,1,null,1,1,10,null,20,5,99]
[{"$f":"\"Stage\"&B15&\"_\"&COUNTIF(B$3:B15,B15)","v":"Stage3_3"},3,"20303",10005,80,10,20,null,2.2999999999999998,0,1,null,16.2,0,1,null,1,0,1,null,1.5,0,1,null,3,0,1,null,5,0,1,null,1,0,1,null,1,1,10,null,20,5,99]
[{"$f":"\"Stage\"&B16&\"_\"&COUNTIF(B$3:B16,B16)","v":"Stage3_4"},3,"20304",0,80,10,20,null,2.2999999999999998,0,1,null,16.2,0,1,null,1,0,1,null,1.5,0,1,null,3,0,1,null,5,0,1,null,1,0,1,null,1,1,10,null,20,5,99]
[{"$f":"\"Stage\"&B17&\"_\"&COUNTIF(B$3:B17,B17)","v":"Stage3_5"},3,"20305",10006,80,10,20,null,2.2999999999999998,0,1,null,16.2,0,1,null,1,0,1,null,1.5,0,1,null,3,0,1,null,5,0,1,null,1,0,1,null,1,1,10,null,20,5,99]
[{"$f":"\"Stage\"&B18&\"_\"&COUNTIF(B$3:B18,B18)","v":"Stage4_1"},4,"20401",10006,80,10,20,null,2.2999999999999998,0,1,null,16.2,0,1,null,1,0,1,null,1.5,0,1,null,3,0,1,null,5,0,1,null,1,0,1,null,1,1,10,null,20,5,99]
[{"$f":"\"Stage\"&B19&\"_\"&COUNTIF(B$3:B19,B19)","v":"Stage4_2"},4,"20402",10007,80,10,20,null,2.2999999999999998,0,1,null,16.2,0,1,null,1,0,1,null,1.5,0,1,null,3,0,1,null,5,0,1,null,1,0,1,null,1,1,10,null,20,5,99]
[{"$f":"\"Stage\"&B20&\"_\"&COUNTIF(B$3:B20,B20)","v":"Stage4_3"},4,"20403",0,80,10,20,null,2.2999999999999998,0,1,null,16.2,0,1,null,1,0,1,null,1.5,0,1,null,3,0,1,null,5,0,1,null,1,0,1,null,1,1,10,null,20,5,99]
[{"$f":"\"Stage\"&B21&\"_\"&COUNTIF(B$3:B21,B21)","v":"Stage4_4"},4,"20404",10007,80,10,20,null,2.2999999999999998,0,1,null,16.2,0,1,null,1,0,1,null,1.5,0,1,null,3,0,1,null,5,0,1,null,1,0,1,null,1,1,10,null,20,5,99]
[{"$f":"\"Stage\"&B22&\"_\"&COUNTIF(B$3:B22,B22)","v":"Stage4_5"},4,"20405",0,80,10,20,null,2.2999999999999998,0,1,null,16.2,0,1,null,1,0,1,null,1.5,0,1,null,3,0,1,null,5,0,1,null,1,0,1,null,1,1,10,null,20,5,99]
[{"$f":"\"Stage\"&B23&\"_\"&COUNTIF(B$3:B23,B23)","v":"Stage4_6"},4,"20406",10008,80,10,20,null,2.2999999999999998,0,1,null,16.2,0,1,null,1,0,1,null,1.5,0,1,null,3,0,1,null,5,0,1,null,1,0,1,null,1,1,10,null,20,5,99]
[{"$f":"\"Stage\"&B24&\"_\"&COUNTIF(B$3:B24,B24)","v":"Stage4_7"},4,"20407",10008,80,10,20,null,2.2999999999999998,0,1,null,16.2,0,1,null,1,0,1,null,1.5,0,1,null,3,0,1,null,5,0,1,null,1,0,1,null,1,1,10,null,20,5,99]
[{"$f":"\"Stage\"&B25&\"_\"&COUNTIF(B$3:B25,B25)","v":"Stage5_1"},5,{"$f":"30&MID(A25,6,1)&0&RIGHT(A25,1)","v":"30501"},10009,80,10,20,null,2.2999999999999998,0,1,null,16.2,0,1,null,1,0,1,null,1.5,0,1,null,3,0,1,null,5,0,1,null,1,0,1,null,1,1,10,null,20,5,99]
[{"$f":"\"Stage\"&B26&\"_\"&COUNTIF(B$3:B26,B26)","v":"Stage5_2"},5,{"$f":"30&MID(A26,6,1)&0&RIGHT(A26,1)","v":"30502"},0,80,10,20,null,2.2999999999999998,0,1,null,16.2,0,1,null,1,0,1,null,1.5,0,1,null,3,0,1,null,5,0,1,null,1,0,1,null,1,1,10,null,20,5,99]
[{"$f":"\"Stage\"&B27&\"_\"&COUNTIF(B$3:B27,B27)","v":"Stage5_3"},5,"30503",10009,80,10,20,null,2.2999999999999998,0,1,null,16.2,0,1,null,1,0,1,null,1.5,0,1,null,3,0,1,null,5,0,1,null,1,0,1,null,1,1,10,null,20,5,99]
[{"$f":"\"Stage\"&B28&\"_\"&COUNTIF(B$3:B28,B28)","v":"Stage5_4"},5,"30504",0,80,10,20,null,2.2999999999999998,0,1,null,16.2,0,1,null,1,0,1,null,1.5,0,1,null,3,0,1,null,5,0,1,null,1,0,1,null,1,1,10,null,20,5,99]
[{"$f":"\"Stage\"&B29&\"_\"&COUNTIF(B$3:B29,B29)","v":"Stage5_5"},5,"30505",10010,80,10,20,null,2.2999999999999998,0,1,null,16.2,0,1,null,1,0,1,null,1.5,0,1,null,3,0,1,null,5,0,1,null,1,0,1,null,1,1,10,null,20,5,99]
[{"$f":"\"Stage\"&B30&\"_\"&COUNTIF(B$3:B30,B30)","v":"Stage5_6"},5,"30506",10010,80,10,20,null,2.2999999999999998,0,1,null,16.2,0,1,null,1,0,1,null,1.5,0,1,null,3,0,1,null,5,0,1,null,1,0,1,null,1,1,10,null,20,5,99]
[{"$f":"\"Stage\"&B31&\"_\"&COUNTIF(B$3:B31,B31)","v":"Stage6_1"},6,"30601",10011,80,10,20,null,2.2999999999999998,0,1,null,16.2,0,1,null,1,0,1,null,1.5,0,1,null,3,0,1,null,5,0,1,null,1,0,1,null,1,1,10,null,20,5,99]
[{"$f":"\"Stage\"&B32&\"_\"&COUNTIF(B$3:B32,B32)","v":"Stage6_2"},6,"30602",0,80,10,20,null,2.2999999999999998,0,1,null,16.2,0,1,null,1,0,1,null,1.5,0,1,null,3,0,1,null,5,0,1,null,1,0,1,null,1,1,10,null,20,5,99]
[{"$f":"\"Stage\"&B33&\"_\"&COUNTIF(B$3:B33,B33)","v":"Stage6_3"},6,"30603",10011,80,10,20,null,2.2999999999999998,0,1,null,16.2,0,1,null,1,0,1,null,1.5,0,1,null,3,0,1,null,5,0,1,null,1,0,1,null,1,1,10,null,20,5,99]
[{"$f":"\"Stage\"&B34&\"_\"&COUNTIF(B$3:B34,B34)","v":"Stage6_4"},6,"30604",0,80,10,20,null,2.2999999999999998,0,1,null,16.2,0,1,null,1,0,1,null,1.5,0,1,null,3,0,1,null,5,0,1,null,1,0,1,null,1,1,10,null,20,5,99]
[{"$f":"\"Stage\"&B35&\"_\"&COUNTIF(B$3:B35,B35)","v":"Stage6_5"},6,"30605",10012,80,10,20,null,2.2999999999999998,0,1,null,16.2,0,1,null,1,0,1,null,1.5,0,1,null,3,0,1,null,5,0,1,null,1,0,1,null,1,1,10,null,20,5,99]
[{"$f":"\"Stage\"&B36&\"_\"&COUNTIF(B$3:B36,B36)","v":"Stage6_6"},6,"30606",0,80,10,20,null,2.2999999999999998,0,1,null,16.2,0,1,null,1,0,1,null,1.5,0,1,null,3,0,1,null,5,0,1,null,1,0,1,null,1,1,10,null,20,5,99]
[{"$f":"\"Stage\"&B37&\"_\"&COUNTIF(B$3:B37,B37)","v":"Stage6_7"},6,"30607",10012,80,10,20,null,2.2999999999999998,0,1,null,16.2,0,1,null,1,0,1,null,1.5,0,1,null,3,0,1,null,5,0,1,null,1,0,1,null,1,1,10,null,20,5,99]
[{"$f":"\"Stage\"&B38&\"_\"&COUNTIF(B$3:B38,B38)","v":"Stage7_1"},7,{"$f":"40&MID(A38,6,1)&0&RIGHT(A38,1)","v":"40701"},0,80,10,20,null,2.2999999999999998,0,1,null,16.2,0,1,null,1,0,1,null,1.5,0,1,null,3,0,1,null,5,0,1,null,1,0,1,null,1,1,10,null,20,5,99]
[{"$f":"\"Stage\"&B39&\"_\"&COUNTIF(B$3:B39,B39)","v":"Stage7_2"},7,{"$f":"40&MID(A39,6,1)&0&RIGHT(A39,1)","v":"40702"},10013,80,10,20,null,2.2999999999999998,0,1,null,16.2,0,1,null,1,0,1,null,1.5,0,1,null,3,0,1,null,5,0,1,null,1,0,1,null,1,1,10,null,20,5,99]
[{"$f":"\"Stage\"&B40&\"_\"&COUNTIF(B$3:B40,B40)","v":"Stage7_3"},7,"40703",0,80,10,20,null,2.2999999999999998,0,1,null,16.2,0,1,null,1,0,1,null,1.5,0,1,null,3,0,1,null,5,0,1,null,1,0,1,null,1,1,10,null,20,5,99]
[{"$f":"\"Stage\"&B41&\"_\"&COUNTIF(B$3:B41,B41)","v":"Stage7_4"},7,"40704",10013,80,10,20,null,2.2999999999999998,0,1,null,16.2,0,1,null,1,0,1,null,1.5,0,1,null,3,0,1,null,5,0,1,null,1,0,1,null,1,1,10,null,20,5,99]
[{"$f":"\"Stage\"&B42&\"_\"&COUNTIF(B$3:B42,B42)","v":"Stage8_1"},8,"40801",10013,80,10,20,null,2.2999999999999998,0,1,null,16.2,0,1,null,1,0,1,null,1.5,0,1,null,3,0,1,null,5,0,1,null,1,0,1,null,1,1,10,null,20,5,99]
[{"$f":"\"Stage\"&B43&\"_\"&COUNTIF(B$3:B43,B43)","v":"Stage8_2"},8,"40802",0,80,10,20,null,2.2999999999999998,0,1,null,16.2,0,1,null,1,0,1,null,1.5,0,1,null,3,0,1,null,5,0,1,null,1,0,1,null,1,1,10,null,20,5,99]
[{"$f":"\"Stage\"&B44&\"_\"&COUNTIF(B$3:B44,B44)","v":"Stage8_3"},8,"40803",10014,80,10,20,null,2.2999999999999998,0,1,null,16.2,0,1,null,1,0,1,null,1.5,0,1,null,3,0,1,null,5,0,1,null,1,0,1,null,1,1,10,null,20,5,99]
[{"$f":"\"Stage\"&B45&\"_\"&COUNTIF(B$3:B45,B45)","v":"Stage8_4"},8,"40804",0,80,10,20,null,2.2999999999999998,0,1,null,16.2,0,1,null,1,0,1,null,1.5,0,1,null,3,0,1,null,5,0,1,null,1,0,1,null,1,1,10,null,20,5,99]
[{"$f":"\"Stage\"&B46&\"_\"&COUNTIF(B$3:B46,B46)","v":"Stage8_5"},8,"40805",10014,80,10,20,null,2.2999999999999998,0,1,null,16.2,0,1,null,1,0,1,null,1.5,0,1,null,3,0,1,null,5,0,1,null,1,0,1,null,1,1,10,null,20,5,99]
[{"$f":"\"Stage\"&B47&\"_\"&COUNTIF(B$3:B47,B47)","v":"Stage9_1"},9,"40901",0,80,10,20,null,2.2999999999999998,0,1,null,16.2,0,1,null,1,0,1,null,1.5,0,1,null,3,0,1,null,5,0,1,null,1,0,1,null,1,1,10,null,20,5,99]
[{"$f":"\"Stage\"&B48&\"_\"&COUNTIF(B$3:B48,B48)","v":"Stage9_2"},9,"40902",10014,80,10,20,null,2.2999999999999998,0,1,null,16.2,0,1,null,1,0,1,null,1.5,0,1,null,3,0,1,null,5,0,1,null,1,0,1,null,1,1,10,null,20,5,99]
[{"$f":"\"Stage\"&B49&\"_\"&COUNTIF(B$3:B49,B49)","v":"Stage9_3"},9,"40903",0,80,10,20,null,2.2999999999999998,0,1,null,16.2,0,1,null,1,0,1,null,1.5,0,1,null,3,0,1,null,5,0,1,null,1,0,1,null,1,1,10,null,20,5,99]
[{"$f":"\"Stage\"&B50&\"_\"&COUNTIF(B$3:B50,B50)","v":"Stage9_4"},9,"40904",10015,80,10,20,null,2.2999999999999998,0,1,null,16.2,0,1,null,1,0,1,null,1.5,0,1,null,3,0,1,null,5,0,1,null,1,0,1,null,1,1,10,null,20,5,99]
[{"$f":"\"Stage\"&B51&\"_\"&COUNTIF(B$3:B51,B51)","v":"Stage9_5"},9,"40905",0,80,10,20,null,2.2999999999999998,0,1,null,16.2,0,1,null,1,0,1,null,1.5,0,1,null,3,0,1,null,5,0,1,null,1,0,1,null,1,1,10,null,20,5,99]
[{"$f":"\"Stage\"&B52&\"_\"&COUNTIF(B$3:B52,B52)","v":"Stage9_6"},9,"40906",10015,80,10,20,null,2.2999999999999998,0,1,null,16.2,0,1,null,1,0,1,null,1.5,0,1,null,3,0,1,null,5,0,1,null,1,0,1,null,1,1,10,null,20,5,99]
[{"$f":"\"Stage\"&B53&\"_\"&COUNTIF(B$3:B53,B53)","v":"Stage10_1"},10,{"$f":"5&MID(A53,6,2)&0&RIGHT(A53,1)","v":"51001"},0,80,10,20,null,2.2999999999999998,0,1,null,16.2,0,1,null,1,0,1,null,1.5,0,1,null,3,0,1,null,5,0,1,null,1,0,1,null,1,1,10,null,20,5,99]
[{"$f":"\"Stage\"&B54&\"_\"&COUNTIF(B$3:B54,B54)","v":"Stage10_2"},10,{"$f":"5&MID(A54,6,2)&0&RIGHT(A54,1)","v":"51002"},0,80,10,20,null,2.2999999999999998,0,1,null,16.2,0,1,null,1,0,1,null,1.5,0,1,null,3,0,1,null,5,0,1,null,1,0,1,null,1,1,10,null,20,5,99]
[{"$f":"\"Stage\"&B55&\"_\"&COUNTIF(B$3:B55,B55)","v":"Stage10_3"},10,{"$f":"5&MID(A55,6,2)&0&RIGHT(A55,1)","v":"51003"},10016,80,10,20,null,2.2999999999999998,0,1,null,16.2,0,1,null,1,0,1,null,1.5,0,1,null,3,0,1,null,5,0,1,null,1,0,1,null,1,1,10,null,20,5,99]
[{"$f":"\"Stage\"&B56&\"_\"&COUNTIF(B$3:B56,B56)","v":"Stage10_4"},10,"51004",0,80,10,20,null,2.2999999999999998,0,1,null,16.2,0,1,null,1,0,1,null,1.5,0,1,null,3,0,1,null,5,0,1,null,1,0,1,null,1,1,10,null,20,5,99]
[{"$f":"\"Stage\"&B57&\"_\"&COUNTIF(B$3:B57,B57)","v":"Stage10_5"},10,"51005",10016,80,10,20,null,2.2999999999999998,0,1,null,16.2,0,1,null,1,0,1,null,1.5,0,1,null,3,0,1,null,5,0,1,null,1,0,1,null,1,1,10,null,20,5,99]
[{"$f":"\"Stage\"&B58&\"_\"&COUNTIF(B$3:B58,B58)","v":"Stage11_1"},11,"51101",0,80,10,20,null,2.2999999999999998,0,1,null,16.2,0,1,null,1,0,1,null,1.5,0,1,null,3,0,1,null,5,0,1,null,1,0,1,null,1,1,10,null,20,5,99]
[{"$f":"\"Stage\"&B59&\"_\"&COUNTIF(B$3:B59,B59)","v":"Stage11_2"},11,"51102",10017,80,10,20,null,2.2999999999999998,0,1,null,16.2,0,1,null,1,0,1,null,1.5,0,1,null,3,0,1,null,5,0,1,null,1,0,1,null,1,1,10,null,20,5,99]
[{"$f":"\"Stage\"&B60&\"_\"&COUNTIF(B$3:B60,B60)","v":"Stage11_3"},11,"51103",0,80,10,20,null,2.2999999999999998,0,1,null,16.2,0,1,null,1,0,1,null,1.5,0,1,null,3,0,1,null,5,0,1,null,1,0,1,null,1,1,10,null,20,5,99]
[{"$f":"\"Stage\"&B61&\"_\"&COUNTIF(B$3:B61,B61)","v":"Stage11_4"},11,"51104",10016,80,10,20,null,2.2999999999999998,0,1,null,16.2,0,1,null,1,0,1,null,1.5,0,1,null,3,0,1,null,5,0,1,null,1,0,1,null,1,1,10,null,20,5,99]
[{"$f":"\"Stage\"&B62&\"_\"&COUNTIF(B$3:B62,B62)","v":"Stage11_5"},11,"51105",10017,80,10,20,null,2.2999999999999998,0,1,null,16.2,0,1,null,1,0,1,null,1.5,0,1,null,3,0,1,null,5,0,1,null,1,0,1,null,1,1,10,null,20,5,99]
[{"$f":"\"Stage\"&B63&\"_\"&COUNTIF(B$3:B63,B63)","v":"Stage12_1"},12,"51201",10018,80,10,20,null,2.2999999999999998,0,1,null,16.2,0,1,null,1,0,1,null,1.5,0,1,null,3,0,1,null,5,0,1,null,1,0,1,null,1,1,10,null,20,5,99]
[{"$f":"\"Stage\"&B64&\"_\"&COUNTIF(B$3:B64,B64)","v":"Stage12_2"},12,"51202",10017,80,10,20,null,2.2999999999999998,0,1,null,16.2,0,1,null,1,0,1,null,1.5,0,1,null,3,0,1,null,5,0,1,null,1,0,1,null,1,1,10,null,20,5,99]
[{"$f":"\"Stage\"&B65&\"_\"&COUNTIF(B$3:B65,B65)","v":"Stage12_3"},12,"51203",10016,80,10,20,null,2.2999999999999998,0,1,null,16.2,0,1,null,1,0,1,null,1.5,0,1,null,3,0,1,null,5,0,1,null,1,0,1,null,1,1,10,null,20,5,99]
[{"$f":"\"Stage\"&B66&\"_\"&COUNTIF(B$3:B66,B66)","v":"Stage12_4"},12,"51204",0,80,10,20,null,2.2999999999999998,0,1,null,16.2,0,1,null,1,0,1,null,1.5,0,1,null,3,0,1,null,5,0,1,null,1,0,1,null,1,1,10,null,20,5,99]
[{"$f":"\"Stage\"&B67&\"_\"&COUNTIF(B$3:B67,B67)","v":"Stage12_5"},12,"51205",10018,80,10,20,null,2.2999999999999998,0,1,null,16.2,0,1,null,1,0,1,null,1.5,0,1,null,3,0,1,null,5,0,1,null,1,0,1,null,1,1,10,null,20,5,99]
[{"$f":"\"Stage\"&B68&\"_\"&COUNTIF(B$3:B68,B68)","v":"Stage12_6"},12,"51206",10017,80,10,20,null,2.2999999999999998,0,1,null,16.2,0,1,null,1,0,1,null,1.5,0,1,null,3,0,1,null,5,0,1,null,1,0,1,null,1,1,10,null,20,5,99]
[{"$f":"\"Stage\"&B69&\"_\"&COUNTIF(B$3:B69,B69)","v":"Stage12_7"},12,"51207",10018,80,10,20,null,2.2999999999999998,0,1,null,16.2,0,1,null,1,0,1,null,1.5,0,1,null,3,0,1,null,5,0,1,null,1,0,1,null,1,1,10,null,20,5,99]
[{"$f":"\"Stage\"&B70&\"_\"&COUNTIF(B$3:B70,B70)","v":"Stage13_1"},13,{"$f":"6&MID(A70,6,2)&0&RIGHT(A70,1)","v":"61301"},0,80,10,20,null,2.2999999999999998,0,1,null,16.2,0,1,null,1,0,1,null,1.5,0,1,null,3,0,1,null,5,0,1,null,1,0,1,null,1,1,10,null,20,5,99]
[{"$f":"\"Stage\"&B71&\"_\"&COUNTIF(B$3:B71,B71)","v":"Stage13_2"},13,{"$f":"6&MID(A71,6,2)&0&RIGHT(A71,1)","v":"61302"},0,80,10,20,null,2.2999999999999998,0,1,null,16.2,0,1,null,1,0,1,null,1.5,0,1,null,3,0,1,null,5,0,1,null,1,0,1,null,1,1,10,null,20,5,99]
[{"$f":"\"Stage\"&B72&\"_\"&COUNTIF(B$3:B72,B72)","v":"Stage13_3"},13,"61303",0,80,10,20,null,2.2999999999999998,0,1,null,16.2,0,1,null,1,0,1,null,1.5,0,1,null,3,0,1,null,5,0,1,null,1,0,1,null,1,1,10,null,20,5,99]
[{"$f":"\"Stage\"&B73&\"_\"&COUNTIF(B$3:B73,B73)","v":"Stage13_4"},13,"61304",10019,80,10,20,null,2.2999999999999998,0,1,null,16.2,0,1,null,1,0,1,null,1.5,0,1,null,3,0,1,null,5,0,1,null,1,0,1,null,1,1,10,null,20,5,99]
[{"$f":"\"Stage\"&B74&\"_\"&COUNTIF(B$3:B74,B74)","v":"Stage14_1"},14,"61401",0,80,10,20,null,2.2999999999999998,0,1,null,16.2,0,1,null,1,0,1,null,1.5,0,1,null,3,0,1,null,5,0,1,null,1,0,1,null,1,1,10,null,20,5,99]
[{"$f":"\"Stage\"&B75&\"_\"&COUNTIF(B$3:B75,B75)","v":"Stage14_2"},14,"61402",0,80,10,20,null,2.2999999999999998,0,1,null,16.2,0,1,null,1,0,1,null,1.5,0,1,null,3,0,1,null,5,0,1,null,1,0,1,null,1,1,10,null,20,5,99]
[{"$f":"\"Stage\"&B76&\"_\"&COUNTIF(B$3:B76,B76)","v":"Stage14_3"},14,"61403",10019,80,10,20,null,2.2999999999999998,0,1,null,16.2,0,1,null,1,0,1,null,1.5,0,1,null,3,0,1,null,5,0,1,null,1,0,1,null,1,1,10,null,20,5,99]
[{"$f":"\"Stage\"&B77&\"_\"&COUNTIF(B$3:B77,B77)","v":"Stage14_4"},14,"61404",0,80,10,20,null,2.2999999999999998,0,1,null,16.2,0,1,null,1,0,1,null,1.5,0,1,null,3,0,1,null,5,0,1,null,1,0,1,null,1,1,10,null,20,5,99]
[{"$f":"\"Stage\"&B78&\"_\"&COUNTIF(B$3:B78,B78)","v":"Stage14_5"},14,"61405",10020,80,10,20,null,2.2999999999999998,0,1,null,16.2,0,1,null,1,0,1,null,1.5,0,1,null,3,0,1,null,5,0,1,null,1,0,1,null,1,1,10,null,20,5,99]
[{"$f":"\"Stage\"&B79&\"_\"&COUNTIF(B$3:B79,B79)","v":"Stage15_1"},15,"61501",0,80,10,20,null,2.2999999999999998,0,1,null,16.2,0,1,null,1,0,1,null,1.5,0,1,null,3,0,1,null,5,0,1,null,1,0,1,null,1,1,10,null,20,5,99]
[{"$f":"\"Stage\"&B80&\"_\"&COUNTIF(B$3:B80,B80)","v":"Stage15_2"},15,"61502",10021,80,10,20,null,2.2999999999999998,0,1,null,16.2,0,1,null,1,0,1,null,1.5,0,1,null,3,0,1,null,5,0,1,null,1,0,1,null,1,1,10,null,20,5,99]
[{"$f":"\"Stage\"&B81&\"_\"&COUNTIF(B$3:B81,B81)","v":"Stage15_3"},15,"61503",0,80,10,20,null,2.2999999999999998,0,1,null,16.2,0,1,null,1,0,1,null,1.5,0,1,null,3,0,1,null,5,0,1,null,1,0,1,null,1,1,10,null,20,5,99]
[{"$f":"\"Stage\"&B82&\"_\"&COUNTIF(B$3:B82,B82)","v":"Stage15_4"},15,"61504",10020,80,10,20,null,2.2999999999999998,0,1,null,16.2,0,1,null,1,0,1,null,1.5,0,1,null,3,0,1,null,5,0,1,null,1,0,1,null,1,1,10,null,20,5,99]
[{"$f":"\"Stage\"&B83&\"_\"&COUNTIF(B$3:B83,B83)","v":"Stage15_5"},15,"61505",10021,80,10,20,null,2.2999999999999998,0,1,null,16.2,0,1,null,1,0,1,null,1.5,0,1,null,3,0,1,null,5,0,1,null,1,0,1,null,1,1,10,null,20,5,99]
[{"$f":"\"Stage\"&B84&\"_\"&COUNTIF(B$3:B84,B84)","v":"Stage16_1"},16,"61601",10020,80,10,20,null,2.2999999999999998,0,1,null,16.2,0,1,null,1,0,1,null,1.5,0,1,null,3,0,1,null,5,0,1,null,1,0,1,null,1,1,10,null,20,5,99]
[{"$f":"\"Stage\"&B85&\"_\"&COUNTIF(B$3:B85,B85)","v":"Stage16_2"},16,"61602",10021,80,10,20,null,2.2999999999999998,0,1,null,16.2,0,1,null,1,0,1,null,1.5,0,1,null,3,0,1,null,5,0,1,null,1,0,1,null,1,1,10,null,20,5,99]
[{"$f":"\"Stage\"&B86&\"_\"&COUNTIF(B$3:B86,B86)","v":"Stage16_3"},16,"61603",10019,80,10,20,null,2.2999999999999998,0,1,null,16.2,0,1,null,1,0,1,null,1.5,0,1,null,3,0,1,null,5,0,1,null,1,0,1,null,1,1,10,null,20,5,99]
[{"$f":"\"Stage\"&B87&\"_\"&COUNTIF(B$3:B87,B87)","v":"Stage17_1"},17,{"$f":"7&MID(A87,6,2)&0&RIGHT(A87,1)","v":"71701"},0,80,10,20,null,2.2999999999999998,0,1,null,16.2,0,1,null,1,0,1,null,1.5,0,1,null,3,0,1,null,5,0,1,null,1,0,1,null,1,1,10,null,20,5,99]
[{"$f":"\"Stage\"&B88&\"_\"&COUNTIF(B$3:B88,B88)","v":"Stage17_2"},17,{"$f":"7&MID(A88,6,2)&0&RIGHT(A88,1)","v":"71702"},10022,80,10,20,null,2.2999999999999998,0,1,null,16.2,0,1,null,1,0,1,null,1.5,0,1,null,3,0,1,null,5,0,1,null,1,0,1,null,1,1,10,null,20,5,99]
[{"$f":"\"Stage\"&B89&\"_\"&COUNTIF(B$3:B89,B89)","v":"Stage17_3"},17,"71703",0,80,10,20,null,2.2999999999999998,0,1,null,16.2,0,1,null,1,0,1,null,1.5,0,1,null,3,0,1,null,5,0,1,null,1,0,1,null,1,1,10,null,20,5,99]
[{"$f":"\"Stage\"&B90&\"_\"&COUNTIF(B$3:B90,B90)","v":"Stage17_4"},17,"71704",10023,80,10,20,null,2.2999999999999998,0,1,null,16.2,0,1,null,1,0,1,null,1.5,0,1,null,3,0,1,null,5,0,1,null,1,0,1,null,1,1,10,null,20,5,99]
[{"$f":"\"Stage\"&B91&\"_\"&COUNTIF(B$3:B91,B91)","v":"Stage17_5"},17,"71705",0,80,10,20,null,2.2999999999999998,0,1,null,16.2,0,1,null,1,0,1,null,1.5,0,1,null,3,0,1,null,5,0,1,null,1,0,1,null,1,1,10,null,20,5,99]
[{"$f":"\"Stage\"&B92&\"_\"&COUNTIF(B$3:B92,B92)","v":"Stage17_6"},17,"71706",10022,80,10,20,null,2.2999999999999998,0,1,null,16.2,0,1,null,1,0,1,null,1.5,0,1,null,3,0,1,null,5,0,1,null,1,0,1,null,1,1,10,null,20,5,99]
[{"$f":"\"Stage\"&B93&\"_\"&COUNTIF(B$3:B93,B93)","v":"Stage17_7"},17,"71707",0,80,10,20,null,2.2999999999999998,0,1,null,16.2,0,1,null,1,0,1,null,1.5,0,1,null,3,0,1,null,5,0,1,null,1,0,1,null,1,1,10,null,20,5,99]
[{"$f":"\"Stage\"&B94&\"_\"&COUNTIF(B$3:B94,B94)","v":"Stage17_8"},17,"71708",10023,80,10,20,null,2.2999999999999998,0,1,null,16.2,0,1,null,1,0,1,null,1.5,0,1,null,3,0,1,null,5,0,1,null,1,0,1,null,1,1,10,null,20,5,99]
[{"$f":"\"Stage\"&B95&\"_\"&COUNTIF(B$3:B95,B95)","v":"Stage18_1"},18,"71801",0,80,10,20,null,2.2999999999999998,0,1,null,16.2,0,1,null,1,0,1,null,1.5,0,1,null,3,0,1,null,5,0,1,null,1,0,1,null,1,1,10,null,20,5,99]
[{"$f":"\"Stage\"&B96&\"_\"&COUNTIF(B$3:B96,B96)","v":"Stage18_2"},18,"71802",10024,80,10,20,null,2.2999999999999998,0,1,null,16.2,0,1,null,1,0,1,null,1.5,0,1,null,3,0,1,null,5,0,1,null,1,0,1,null,1,1,10,null,20,5,99]
[{"$f":"\"Stage\"&B97&\"_\"&COUNTIF(B$3:B97,B97)","v":"Stage18_3"},18,"71803",10022,80,10,20,null,2.2999999999999998,0,1,null,16.2,0,1,null,1,0,1,null,1.5,0,1,null,3,0,1,null,5,0,1,null,1,0,1,null,1,1,10,null,20,5,99]
[{"$f":"\"Stage\"&B98&\"_\"&COUNTIF(B$3:B98,B98)","v":"Stage18_4"},18,"71804",10023,80,10,20,null,2.2999999999999998,0,1,null,16.2,0,1,null,1,0,1,null,1.5,0,1,null,3,0,1,null,5,0,1,null,1,0,1,null,1,1,10,null,20,5,99]
[{"$f":"\"Stage\"&B99&\"_\"&COUNTIF(B$3:B99,B99)","v":"Stage18_5"},18,"71805",0,80,10,20,null,2.2999999999999998,0,1,null,16.2,0,1,null,1,0,1,null,1.5,0,1,null,3,0,1,null,5,0,1,null,1,0,1,null,1,1,10,null,20,5,99]
[{"$f":"\"Stage\"&B100&\"_\"&COUNTIF(B$3:B100,B100)","v":"Stage18_6"},18,"71806",10024,80,10,20,null,2.2999999999999998,0,1,null,16.2,0,1,null,1,0,1,null,1.5,0,1,null,3,0,1,null,5,0,1,null,1,0,1,null,1,1,10,null,20,5,99]
[{"$f":"\"Stage\"&B101&\"_\"&COUNTIF(B$3:B101,B101)","v":"Stage18_7"},18,"71807",0,80,10,20,null,2.2999999999999998,0,1,null,16.2,0,1,null,1,0,1,null,1.5,0,1,null,3,0,1,null,5,0,1,null,1,0,1,null,1,1,10,null,20,5,99]
[{"$f":"\"Stage\"&B102&\"_\"&COUNTIF(B$3:B102,B102)","v":"Stage18_8"},18,"71808",10024,80,10,20,null,2.2999999999999998,0,1,null,16.2,0,1,null,1,0,1,null,1.5,0,1,null,3,0,1,null,5,0,1,null,1,0,1,null,1,1,10,null,20,5,99]
[{"$f":"\"Stage\"&B103&\"_\"&COUNTIF(B$3:B103,B103)","v":"Stage19_1"},19,{"$f":"8&MID(A103,6,2)&0&RIGHT(A103,1)","v":"81901"},0,80,10,20,null,2.2999999999999998,0,1,null,16.2,0,1,null,1,0,1,null,1.5,0,1,null,3,0,1,null,5,0,1,null,1,0,1,null,1,1,10,null,20,5,99]
[{"$f":"\"Stage\"&B104&\"_\"&COUNTIF(B$3:B104,B104)","v":"Stage19_2"},19,{"$f":"8&MID(A104,6,2)&0&RIGHT(A104,1)","v":"81902"},10025,80,10,20,null,2.2999999999999998,0,1,null,16.2,0,1,null,1,0,1,null,1.5,0,1,null,3,0,1,null,5,0,1,null,1,0,1,null,1,1,10,null,20,5,99]
[{"$f":"\"Stage\"&B105&\"_\"&COUNTIF(B$3:B105,B105)","v":"Stage19_3"},19,"81903",0,80,10,20,null,2.2999999999999998,0,1,null,16.2,0,1,null,1,0,1,null,1.5,0,1,null,3,0,1,null,5,0,1,null,1,0,1,null,1,1,10,null,20,5,99]
[{"$f":"\"Stage\"&B106&\"_\"&COUNTIF(B$3:B106,B106)","v":"Stage19_4"},19,"81904",10026,80,10,20,null,2.2999999999999998,0,1,null,16.2,0,1,null,1,0,1,null,1.5,0,1,null,3,0,1,null,5,0,1,null,1,0,1,null,1,1,10,null,20,5,99]
[{"$f":"\"Stage\"&B107&\"_\"&COUNTIF(B$3:B107,B107)","v":"Stage19_5"},19,"81905",0,80,10,20,null,2.2999999999999998,0,1,null,16.2,0,1,null,1,0,1,null,1.5,0,1,null,3,0,1,null,5,0,1,null,1,0,1,null,1,1,10,null,20,5,99]
[{"$f":"\"Stage\"&B108&\"_\"&COUNTIF(B$3:B108,B108)","v":"Stage19_6"},19,"81906",10025,80,10,20,null,2.2999999999999998,0,1,null,16.2,0,1,null,1,0,1,null,1.5,0,1,null,3,0,1,null,5,0,1,null,1,0,1,null,1,1,10,null,20,5,99]
[{"$f":"\"Stage\"&B109&\"_\"&COUNTIF(B$3:B109,B109)","v":"Stage19_7"},19,"81907",0,80,10,20,null,2.2999999999999998,0,1,null,16.2,0,1,null,1,0,1,null,1.5,0,1,null,3,0,1,null,5,0,1,null,1,0,1,null,1,1,10,null,20,5,99]
[{"$f":"\"Stage\"&B110&\"_\"&COUNTIF(B$3:B110,B110)","v":"Stage19_8"},19,"81908",10026,80,10,20,null,2.2999999999999998,0,1,null,16.2,0,1,null,1,0,1,null,1.5,0,1,null,3,0,1,null,5,0,1,null,1,0,1,null,1,1,10,null,20,5,99]
[{"$f":"\"Stage\"&B111&\"_\"&COUNTIF(B$3:B111,B111)","v":"Stage19_9"},19,"81909",10025,80,10,20,null,2.2999999999999998,0,1,null,16.2,0,1,null,1,0,1,null,1.5,0,1,null,3,0,1,null,5,0,1,null,1,0,1,null,1,1,10,null,20,5,99]
[{"$f":"\"Stage\"&B112&\"_\"&COUNTIF(B$3:B112,B112)","v":"Stage20_1"},20,"82001",0,80,10,20,null,2.2999999999999998,0,1,null,16.2,0,1,null,1,0,1,null,1.5,0,1,null,3,0,1,null,5,0,1,null,1,0,1,null,1,1,10,null,20,5,99]
[{"$f":"\"Stage\"&B113&\"_\"&COUNTIF(B$3:B113,B113)","v":"Stage20_2"},20,"82002",10025,80,10,20,null,2.2999999999999998,0,1,null,16.2,0,1,null,1,0,1,null,1.5,0,1,null,3,0,1,null,5,0,1,null,1,0,1,null,1,1,10,null,20,5,99]
[{"$f":"\"Stage\"&B114&\"_\"&COUNTIF(B$3:B114,B114)","v":"Stage20_3"},20,"82003",0,80,10,20,null,2.2999999999999998,0,1,null,16.2,0,1,null,1,0,1,null,1.5,0,1,null,3,0,1,null,5,0,1,null,1,0,1,null,1,1,10,null,20,5,99]
[{"$f":"\"Stage\"&B115&\"_\"&COUNTIF(B$3:B115,B115)","v":"Stage20_4"},20,"82004",10027,80,10,20,null,2.2999999999999998,0,1,null,16.2,0,1,null,1,0,1,null,1.5,0,1,null,3,0,1,null,5,0,1,null,1,0,1,null,1,1,10,null,20,5,99]
[{"$f":"\"Stage\"&B116&\"_\"&COUNTIF(B$3:B116,B116)","v":"Stage20_5"},20,"82005",0,80,10,20,null,2.2999999999999998,0,1,null,16.2,0,1,null,1,0,1,null,1.5,0,1,null,3,0,1,null,5,0,1,null,1,0,1,null,1,1,10,null,20,5,99]
[{"$f":"\"Stage\"&B117&\"_\"&COUNTIF(B$3:B117,B117)","v":"Stage20_6"},20,"82006",0,80,10,20,null,2.2999999999999998,0,1,null,16.2,0,1,null,1,0,1,null,1.5,0,1,null,3,0,1,null,5,0,1,null,1,0,1,null,1,1,10,null,20,5,99]
[{"$f":"\"Stage\"&B118&\"_\"&COUNTIF(B$3:B118,B118)","v":"Stage20_7"},20,"82007",10027,80,10,20,null,2.2999999999999998,0,1,null,16.2,0,1,null,1,0,1,null,1.5,0,1,null,3,0,1,null,5,0,1,null,1,0,1,null,1,1,10,null,20,5,99]
[{"$f":"\"Stage\"&B119&\"_\"&COUNTIF(B$3:B119,B119)","v":"Stage20_8"},20,"82008",0,80,10,20,null,2.2999999999999998,0,1,null,16.2,0,1,null,1,0,1,null,1.5,0,1,null,3,0,1,null,5,0,1,null,1,0,1,null,1,1,10,null,20,5,99]
[{"$f":"\"Stage\"&B120&\"_\"&COUNTIF(B$3:B120,B120)","v":"Stage20_9"},20,"82009",10028,80,10,20,null,2.2999999999999998,0,1,null,16.2,0,1,null,1,0,1,null,1.5,0,1,null,3,0,1,null,5,0,1,null,1,0,1,null,1,1,10,null,20,5,99]
[{"$f":"\"Stage\"&B121&\"_\"&COUNTIF(B$3:B121,B121)","v":"Stage21_1"},21,"82101",10027,80,10,20,null,2.2999999999999998,0,1,null,16.2,0,1,null,1,0,1,null,1.5,0,1,null,3,0,1,null,5,0,1,null,1,0,1,null,1,1,10,null,20,5,99]
[{"$f":"\"Stage\"&B122&\"_\"&COUNTIF(B$3:B122,B122)","v":"Stage21_2"},21,"82102",0,80,10,20,null,2.2999999999999998,0,1,null,16.2,0,1,null,1,0,1,null,1.5,0,1,null,3,0,1,null,5,0,1,null,1,0,1,null,1,1,10,null,20,5,99]
[{"$f":"\"Stage\"&B123&\"_\"&COUNTIF(B$3:B123,B123)","v":"Stage21_3"},21,"82103",10028,80,10,20,null,2.2999999999999998,0,1,null,16.2,0,1,null,1,0,1,null,1.5,0,1,null,3,0,1,null,5,0,1,null,1,0,1,null,1,1,10,null,20,5,99]
[{"$f":"\"Stage\"&B124&\"_\"&COUNTIF(B$3:B124,B124)","v":"Stage21_4"},21,"82104",10028,80,10,20,null,2.2999999999999998,0,1,null,16.2,0,1,null,1,0,1,null,1.5,0,1,null,3,0,1,null,5,0,1,null,1,0,1,null,1,1,10,null,20,5,99]

{"sheet":"ItemList","index":14,"n_rows":40,"n_cols":11,"rows_kept":40,"cut":false,"hidden":false,"merged":[]}
["n_ItemID","n_ItemGrade","e_ItemType","n_ItemValue","n_ItemName","n_PurchaseGoodsType","n_ItemPrice","n_ItemDesc","s_ItemIcon","n_ItemOrder","exception"]
["_아이템 ID","아이템 등급","아이템 타입","아이템 값","아이템 이름","아이템 구입 시 재화 ID","아이템 기본 가격","아이템 설명","아이템 아이콘","아이템 정렬 순서","참고용 텍스트"]
[-2,1,"Goods",0,-4002,0,0,0,0,0,"실제 현금"]
[-1,1,"Goods",0,-4001,0,0,0,"ad",0,"AD"]
[101,1,"Goods",0,100101,201,10000,0,"icon_gem",0,"캐시"]
[201,1,"Goods",0,100201,101,100,0,"icon_gold",0,"골드"]
[301,1,"Goods",0,100301,101,200,0,"icon_soul",0,"소울"]
[401,1,"Goods",0,100401,101,500,0,"potion_01",0,"회복 물약"]
[501,1,"Goods",0,100501,0,0,0,"icon_exp",0,"경험치"]
[601,1,"Goods",0,100601,0,0,0,"stone_01",0,"한계돌파 재화"]
[6001,1,"PC",0,6001,0,0,0,"hero_01",0]
[6002,1,"PC",0,6002,101,10,0,"hero_02",0]
[6003,1,"PC",0,6003,101,20,0,"hero_03",0]
[6004,1,"PC",0,6004,101,30,0,"hero_04",0]
[6005,1,"PC",0,6005,101,40,0,"hero_05",0]
[20101,1,"Seal",0,20101,0,0,0,"seal_001",0,"인장1"]
[20102,1,"Seal",0,20102,0,0,0,"seal_002",0,"인장2"]
[20103,1,"Seal",0,20103,0,0,0,"seal_003",0,"인장3"]
[20104,1,"Seal",0,20104,0,0,0,"seal_004",0,"인장4"]
[20105,1,"Seal",0,20105,0,0,0,"seal_005",0,"인장5"]
[20106,1,"Seal",0,20106,0,0,0,"seal_006",0,"인장6"]
[20107,1,"Seal",0,20107,0,0,0,"seal_007",0,"인장7"]
[20108,1,"Seal",0,20108,0,0,0,"seal_008",0,"인장8"]
[20109,1,"Seal",0,20109,0,0,0,"seal_009",0,"인장9"]
[20110,1,"Seal",0,20110,0,0,0,"seal_010",0,"인장10"]
[20111,1,"Seal",0,20111,0,0,0,"seal_011",0,"인장11"]
[20112,1,"Seal",0,20112,0,0,0,"seal_012",0,"인장12"]
[30101,1,"Equipment",0,{"$f":"A28","v":30101},0,0,0,{"$f":"\"Weapon_\"&A28","v":"Weapon_30101"},0,"무기"]
[30201,2,"Equipment",0,{"$f":"A29","v":30201},0,0,0,{"$f":"\"Weapon_\"&A29","v":"Weapon_30201"},0,"무기"]
[30301,3,"Equipment",0,30301,0,0,0,"Weapon_30301",0,"무기"]
[30401,4,"Equipment",0,30401,0,0,0,"Weapon_30401",0,"무기"]
[30501,5,"Equipment",0,30501,0,0,0,"Weapon_30501",0,"무기"]
[30502,5,"Equipment",0,30502,0,0,0,"Weapon_30502",0,"무기"]
[31101,1,"Equipment",0,31101,0,0,0,{"$f":"\"SubWeapon_\"&A34","v":"SubWeapon_31101"},0,"보조장비"]
[32101,1,"Equipment",0,32101,0,0,0,{"$f":"\"ArmorTop_\"&A35","v":"ArmorTop_32101"},0,"갑옷(상의)"]
[33101,1,"Equipment",0,33101,0,0,0,{"$f":"\"ArmorBottom_\"&A36","v":"ArmorBottom_33101"},0,"갑옷(하의)"]
[34101,1,"Equipment",0,34101,0,0,0,{"$f":"\"Gloves_\"&A37","v":"Gloves_34101"},0,"장갑"]
[35101,1,"Equipment",0,35101,0,0,0,{"$f":"\"Shoes_\"&A38","v":"Shoes_35101"},0,"신발"]
[36101,1,"Equipment",0,36101,0,0,0,{"$f":"\"Ring_\"&A39","v":"Ring_36101"},0,"반지"]
[37101,1,"Equipment",0,37101,0,0,0,{"$f":"\"Necklace_\"&A40","v":"Necklace_37101"},0,"목걸이"]

{"sheet":"BattleLevelUp","index":15,"n_rows":22,"n_cols":3,"rows_kept":22,"cut":false,"hidden":false,"merged":[]}
["n_Lv","n_NextRequireExp","n_TotalExp"]
["_레벨","레벨업 필요 경험치","누적 경험치"]
[1,3,3]
[2,7,10]
[3,14,{"$f":"C4+B5","v":24}]
[4,22,{"$f":"C5+B6","v":46}]
[5,32,78]
[6,{"$f":"B7+(INT(A8/2)+8)","v":43},121]
[7,{"$f":"B8+(INT(SQRT(A9*20))+1)","v":55},176]
[8,{"$f":"B9+(INT(SQRT(A10*20))+1)","v":68},244]
[9,82,326]
[10,97,423]
[11,{"$f":"B12+(INT(SQRT(A13*25))+1)","v":114},537]
[12,{"$f":"B13+(INT(SQRT(A14*25))+1)","v":132},669]
[13,151,820]
[14,{"$f":"B15+(INT(SQRT(A16*30))+1)","v":172},992]
[15,{"$f":"B16+(INT(SQRT(A17*30))+1)","v":194},1186]
[16,{"$f":"B17+(INT(SQRT(A18*38))+1)","v":219},1405]
[17,{"$f":"B18+(INT(SQRT(A19*38))+1)","v":245},1650]
[18,272,1922]
[19,300,2222]
[20,0,2222]

{"sheet":"ActorTalkConfig","index":16,"n_rows":50,"n_cols":7,"rows_kept":50,"cut":false,"hidden":false,"merged":[]}
["n_TalkID","n_TalkPattern1","n_TalkPattern2","n_TalkPattern3","n_TalkPattern4","n_TalkPattern5","n_TalkPattern6"]
["_NPC나 상인 대화에 쓸 대사 그룹 ID","대화 패턴1","대화 패턴2","대화 패턴3","대화 패턴4","대화 패턴5","대화 패턴6"]
[501010,{"$f":"A3+1","v":501011},{"$f":"B3+1","v":501012},501013,501014,501015,501016]
[501020,{"$f":"A4+1","v":501021},{"$f":"B4+1","v":501022},501023,501024,501025,501026]
[{"$f":"A4+10","v":501030},{"$f":"A5+1","v":501031},501032,501033,501034,501035,501036]
[{"$f":"A5+10","v":501040},{"$f":"A6+1","v":501041},501042,501043,501044,501045,501046]
[501050,{"$f":"A7+1","v":501051},501052,501053,501054,501055,501056]
[501060,{"$f":"A8+1","v":501061},501062,501063,501064,501065,501066]
[{"$f":"A3+1000","v":502010},{"$f":"A9+1","v":502011},502012,502013,502014,502015,502016]
[{"$f":"A4+1000","v":502020},{"$f":"A10+1","v":502021},502022,502023,502024,502025,502026]
[502030,{"$f":"A11+1","v":502031},502032,502033,502034,502035,502036]
[502040,{"$f":"A12+1","v":502041},502042,502043,502044,502045,502046]
[502050,{"$f":"A13+1","v":502051},502052,502053,502054,502055,502056]
[502060,{"$f":"A14+1","v":502061},502062,502063,502064,502065,502066]
[503010,{"$f":"A15+1","v":503011},503012,503013,503014,503015,503016]
[503020,{"$f":"A16+1","v":503021},503022,503023,503024,503025,503026]
[503030,{"$f":"A17+1","v":503031},503032,503033,503034,503035,503036]
[503040,{"$f":"A18+1","v":503041},503042,503043,503044,503045,503046]
[503050,{"$f":"A19+1","v":503051},503052,503053,503054,503055,503056]
[503060,{"$f":"A20+1","v":503061},503062,503063,503064,503065,503066]
[504010,{"$f":"A21+1","v":504011},504012,504013,504014,504015,504016]
[504020,{"$f":"A22+1","v":504021},504022,504023,504024,504025,504026]
[504030,{"$f":"A23+1","v":504031},504032,504033,504034,504035,504036]
[504040,{"$f":"A24+1","v":504041},504042,504043,504044,504045,504046]
[504050,{"$f":"A25+1","v":504051},504052,504053,504054,504055,504056]
[504060,{"$f":"A26+1","v":504061},504062,504063,504064,504065,504066]
[505010,{"$f":"A27+1","v":505011},505012,505013,505014,505015,505016]
[505020,{"$f":"A28+1","v":505021},505022,505023,505024,505025,505026]
[505030,{"$f":"A29+1","v":505031},505032,505033,505034,505035,505036]
[505040,{"$f":"A30+1","v":505041},505042,505043,505044,505045,505046]
[505050,{"$f":"A31+1","v":505051},505052,505053,505054,505055,505056]
[505060,{"$f":"A32+1","v":505061},505062,505063,505064,505065,505066]
[506010,{"$f":"A33+1","v":506011},506012,506013,506014,506015,506016]
[506020,{"$f":"A34+1","v":506021},506022,506023,506024,506025,506026]
[506030,{"$f":"A35+1","v":506031},506032,506033,506034,506035,506036]
[506040,{"$f":"A36+1","v":506041},506042,506043,506044,506045,506046]
[506050,{"$f":"A37+1","v":506051},506052,506053,506054,506055,506056]
[506060,{"$f":"A38+1","v":506061},506062,506063,506064,506065,506066]
[507010,{"$f":"A39+1","v":507011},507012,507013,507014,507015,507016]
[507020,{"$f":"A40+1","v":507021},507022,507023,507024,507025,507026]
[507030,{"$f":"A41+1","v":507031},507032,507033,507034,507035,507036]
[507040,{"$f":"A42+1","v":507041},507042,507043,507044,507045,507046]
[507050,{"$f":"A43+1","v":507051},507052,507053,507054,507055,507056]
[507060,{"$f":"A44+1","v":507061},507062,507063,507064,507065,507066]
[508010,{"$f":"A45+1","v":508011},508012,508013,508014,508015,508016]
[508020,{"$f":"A46+1","v":508021},508022,508023,508024,508025,508026]
[508030,{"$f":"A47+1","v":508031},508032,508033,508034,508035,508036]
[508040,{"$f":"A48+1","v":508041},508042,508043,508044,508045,508046]
[508050,{"$f":"A49+1","v":508051},508052,508053,508054,508055,508056]
[508060,{"$f":"A50+1","v":508061},508062,508063,508064,508065,508066]

{"sheet":"Localization","index":17,"n_rows":1305,"n_cols":4,"rows_kept":1305,"cut":false,"hidden":false,"merged":[]}
["ID","s_Korean","s_English","s_Japan"]
["_Text 고유 인덱스","한국어 텍스트","영어 텍스트","일본어 텍스트"]
[1,"게임 데이터를 확인 중입니다."]
[2,"구글 플레이에서 설치한 앱이 아닙니다. 앱을 종료합니다."]
[3,"로그인 중입니다."]
[4,"화면을 터치해 주세요."]
[5,"확인"]
[101,"탐험"]
[102,"잡화점 강화"]
[103,"전투 패배!"]
[104,"부활하시겠습니까?"]
[105,"획득한 전리품"]
[106,"부활"]
[107,"포기"]
[108,"빗나감"]
[109,"스킬을 선택해 주세요."]
[110,"리롤"]
[111,"무효화"]
[112,"치명타"]
[113,"탐험을 포기할 경우, 획득한 전리품을 몬스터에게 모두 빼앗깁니다."]
[114,"에휴… 두고보자!"]
[115,"오~ 오늘 수확이 쏠쏠한데?"]
[116,"전투 승리!"]
[117,"획득한 경험치"]
[118,"전리품"]
[119,"전리품x2"]
[120,"덱 정보"]
[121,"변경"]
[122,"습득 스킬 : {0}개"]
[123,"보유 특성 ({0}/4)"]
[124,"스킬 선택"]
[125,"출전"]
[126,"아이템이 부족합니다."]
[127,"판매"]
[128,"세트 정보"]
[129,"장비 열기"]
[130,"장착중"]
[201,"Normal"]
[202,"Rare"]
[203,"Epic"]
[204,"Unique"]
[205,"Legend"]
[211,"쉬움"]
[212,"보통"]
[213,"어려움"]
[301,"수상한 던전"]
[302,"챕터2 던전"]
[303,"챕터3 던전"]
[304,"챕터4 던전"]
[305,"챕터5 던전"]
[306,"챕터6 던전"]
[307,"챕터7 던전"]
[308,"챕터8 던전"]
[1001,"공격"]
[1002,"방어"]
[1003,"회피"]
[1101,"무시하기"]
[1102,"강제 개방","Force Open"]
[1103,"확률 +{0}%"]
[1104,"열쇠 사용"]
[1105,"보물상자 발견!"]
[1106,"<size = 100>미믹 등장!"]
[1107,"상자 열기"]
[1201,"암상인 등장!"]
[1202,"대화"]
[1203,"훔치기"]
[1204,"거래"]
[1205,"구매"]
[1206,"취소"]
[1207,"Sale {0}%"]
[1301,"여행자 발견!"]
[1302,"선물"]
[1303,"준다"]
[1401,"성소 발견!"]
[1402,"조사하기"]
[1411,"즉시 모든 생명력과 보호막을 회복한다."]
[1412,"남은 경험치에 관계 없이 즉시 레벨 업을 한다."]
[1413,"죽었을 경우 부활 할 수 있는 버프가 1회 추가 된다."]
[1414,"랜덤 스킬 1개를 즉시 획득한다. (※선택지 없음)"]
[1415,"획득 가능한 모든 경험치가 2배가 된다."]
[1416,"획득 가능한 모든 골드가 2배가 된다."]
[1417,"즉시 영혼 재화를 랜덤 획득한다."]
[1418,"즉시 대량의 골드를 획득한다."]
[1419,"일정 시간 무적 상태가 된다."]
[1420,"약간의 생명력을 회복한다."]
[1421,"약간의 경험치를 획득한다."]
[1422,"약간의 보호막이 회복된다."]
[1423,"습득할 스킬을 선택하세요."]
[1501,"수상한 버섯 발견!"]
[1502,"먹어본다"]
[1503,"무시한다"]
[1601,"갈림길 발견!"]
[1602,"왼쪽 길"]
[1603,"오른쪽 길"]
[1701,"캠프파이어 발견!"]
[1801,"아무것도 발견하지 못했다…"]
[1901,"몬스터와 조우했다!!"]
[2001,"쉬움"]
[2002,"보통"]
[2003,"어려움"]
[2004,"지옥"]
[2005,"불지옥"]
[2006,"악몽"]
[4000,"공격력"]
[4001,"최소 공격력"]
[4002,"최대 공격력"]
[4003,"치명타 확률"]
[4004,"치명타 피해율"]
[4005,"명중력"]
[4006,"생명력"]
[4007,"최대 생명력"]
[4008,"보호막"]
[4009,"최대 보호막"]
[4010,"근접 회피율"]
[4011,"원거리 회피율"]
[5001,"몬스터1"]
[5002,"몬스터2"]
[5003,"몬스터3"]
[5004,"몬스터4"]
[5005,"몬스터5"]
[5006,"몬스터6"]
[5007,"몬스터7"]
[5008,"몬스터8"]
[5009,"몬스터9"]
[5010,"몬스터10"]
[5011,"몬스터11"]
[5012,"몬스터12"]
[5013,"몬스터13"]
[5014,"몬스터14"]
[5015,"몬스터15"]
[5016,"몬스터16"]
[5017,"몬스터17"]
[5018,"몬스터18"]
[5019,"몬스터19"]
[5020,"몬스터20"]
[5021,"몬스터21"]
[5022,"몬스터22"]
[5023,"몬스터23"]
[6001,"PC1"]
[9001,"수상한 동굴"]
[9002,"트롤 은신처"]
[9003,"오크의 소굴"]
[9004,"잊혀진 미궁"]
[9005,"고블린 성채"]
[9006,"악마의 은신처"]
[9007,"죽음의 회랑"]
[9008,"언데드 실험실"]
[9009,"거인의 신전"]
[9010,"임프 서식지"]
[9011,"악마의 소굴"]
[9012,"피의 성채"]
[9013,"드래곤 서식지"]
[9014,"마녀의 은신처"]
[9015,"광신자의 탑"]
[9016,"봉인 된 미궁"]
[9017,"용의 성지"]
[9018,"고대의 신전"]
[9019,"악마의 탑"]
[9020,"이계의 신전"]
[9021,"타락 천사의 수도원"]
[10001,"일반 몬스터"]
[10002,"보물상자"]
[10003,"암상인"]
[10004,"NPC"]
[10005,"성소"]
[10006,"버프디버프"]
[10007,"갈림길"]
[10008,"캠프"]
[10009,"없음"]
[10010,"보스 몬스터"]
[11001,"회복의 성소"]
[11002,"성장의 성소"]
[11003,"부활의 성소"]
[11004,"스킬의 성소"]
[11005,"지식의 성소"]
[11006,"재물의 성소 "]
[11007,"영혼의 성소"]
[11008,"황금의 성소 "]
[11009,"무적의 성소 "]
[11010,"치유의 샘"]
[11011,"경험의 샘"]
[11012,"보호의 샘 "]
[13024,"루시 특성1"]
[13025,"루시 특성2"]
[13026,"루시 특성3"]
[13027,"루시 특성4"]
[14024,"루시 기본 공격"]
[14025,"훔치기 확률과 선제공격을 받을 때 회피 확률 각각 증가"]
[14026,"피격 당한 횟수에 비례해 치명타 확률이 점차 증가 (※치명타 발동 후 초기화)"]
[14027,"치명타 피해량 증가"]
[20101,"인장1"]
[20102,"인장2"]
[20103,"인장3"]
[20104,"인장4"]
[20105,"인장5"]
[20106,"인장6"]
[20107,"인장7"]
[20108,"인장8"]
[20109,"인장9"]
[20110,"인장10"]
[20111,"인장11"]
[20112,"인장12"]
[30001,"고소하고 향긋한 맛에 기분이 좋아졌다.\\n생명력 {0} 회복"]
[30002,"포근한 식감에 몸과 마음이 가벼워진 느낌이 들었다.\\n실드 {0} 회복"]
[30003,"버섯을 먹고나니 갑자기 극심한 복통이 몰려왔다..\\n중독 효과 발생!"]
[30004,"버섯을 채취하려고 할 때 몬스터가 튀어나왔다.\\n전투 발생!"]
[30005,"온 몸에 따듯한 기운이 퍼지는 기분이 들었다.\\n최대 생명력 {0} 증가"]
[30006,"갑자기 극심한 통증과 함께 오한이 느껴졌다.\\n최대 생명력 {0} 감소"]
[30007,"신비한 기운이 온 몸을 감싸는 기분이 들었다.\\n최대 실드 {0} 증가"]
[30008,"환각이 느껴지고 몸에서 힘이 빠져나가는 기분이 들었다.\\n최대 실드 {0} 감소"]
[30009,"상쾌한 기분과 함께 온 몸에 힘이 솟아났다.\\n공격력 {0} 증가"]
[30010,"온 몸이 마비 된 것처럼 뻣뻣해지며 힘이 빠져나갔다.\\n공격력 {0} 감소"]
[30011,"온 몸에 활력이 넘치고 가벼워진 느낌이 들었다.\\n회피율 {0}% 증가"]
[30012,"알 수 없는 환청과 환각이 들리며 온몸이 무거워졌다.\\n회피율 {0}% 감소"]
[30013,"정신이 맑아지고 집중력이 향상 된 느낌이 들었다.\\n명중력 {0} 증가"]
[30014,"극심한 오한 때문에 온 몸이 떨려 제대로 서있기도 힘들다.\\n명중력 {0} 감소"]
[30015,"감각이 예민해지고 시야가 선명해진 느낌이 든다.\\n치명타 확률 {0}% 증가"]
[30016,"점점 감각이 무뎌지고 시야가 흐릿해진다.\\n치명타 확률 {0}% 감소"]
[30017,"기분 좋은 포만감 때문인지 힘이 마구 솟구친다.\\n치명타 피해량 {0}% 증가"]
[30018,"온 몸에 힘이 빠져나간 듯 의욕이 느껴지지 않는다.\\n치명타 피해량 {0}% 감소"]
[30019,"피곤함이 가시고 온 몸에 활력이 솟아나는 기분이 든다.\\n공격 속도 {0}% 증가"]
[30020,"극심한 피로감이 느껴져 움직이기 조차 힘든 기분이다.\\n공격 속도 {0}% 감소"]
[30101,"무기1-1"]
[30201,"무기2-1"]
[30301,"무기3-1"]
[30401,"무기4-1"]
[30501,"무기5-1"]
[30502,"무기5-2"]
[31101,"보조장비1-1"]
[32101,"상의 1-1"]
[33101,"하의 1-1"]
[34101,"장갑 1-1"]
[35101,"신발 1-1"]
[36101,"반지 1-1"]
[37101,"목걸이 1-1"]
[40001,"생명력과 보호막이 완전히 회복됩니다."]
[40002,"고대의 지식을 얻어 즉시 레벨업합니다."]
[40003,"사망 시 부활 효과를 얻었습니다."]
[40004,"임의의 스킬 카드를 획득했습니다."]
[40005,"경험치 획득량 x2배 효과를 얻었습니다."]
[40006,"골드 획득량 x2배 효과를 얻었습니다."]
[40007,"{0} 소울을 획득했습니다."]
[40008,"{0} 골드를 획득했습니다."]
[40009,"{0}초 동안 무적 상태가 됩니다."]
[40010,"생명력 {0} 회복했습니다."]
[40011,"경험치를 {0} 습득했습니다."]
[40012,"보호막이 {0} 회복되었습니다."]
[100101,"골드"]
[100201,"캐시"]
[100301,"소울"]
[100401,"물약"]
[100501,"경험치"]
[100601,"한계돌파 스톤"]
[101001,"물약 최대 보유량을 +{0} 추가하고, 물약을 {0}개를 획득합니다."]
[101002,"전투 시작 후 첫 번째 공격은 +{0}%의 피해를 입힙니다."]
[101003,"최대 피해가 +{0} 증가합니다."]
[101004,"최소 피해가 +{0} 증가합니다."]
[101005,"전투 시작 후 첫 번째 공격은 후열의 적에게도 피해를 입히는 환영의 창을 시전합니다."]
[101006,"명중력이 +{0} 증가합니다."]
[101007,"빗나감 없이 {0}회 공격을 명중할 때마다 피해 {1}%의 전기 충격을 시전합니다."]
[101008,"회복의 성소에서 얻는 회복 효과와 경험치가 +{0}% 증가합니다."]
[101009,"전투 시작 후 매 {1}초가 지날 때마다 무작위 적에게 매직 미사일을 {0}발 발사합니다."]
[101010,"치명타 피해량이 x{0}배 증가합니다."]
[101011,"회피 발동 시 무작위 적의 생명력을 {0}만큼 흡혈합니다."]
[101012,"치명타 처치 시 경험치를 +{0}% 획득합니다."]
[101013,"신비한 폭발 스킬 1회를 즉시 시전합니다. (※즉시 시전 : 카드 획득 시점에만 발동)"]
[101014,"근접 적이 전열에 등장할 때마다 {0}의 신성 피해를 입힙니다."]
[101015,"공격을 {0}회 받을 때마다 받는 피해를 무효화 합니다."]
[101016,"다음 {0}회의 공격을 무조건 회피합니다."]
[101017,"회피 시 후열에 있는 모든 적에게 {0}의 신성 피해를 입힙니다."]
[101018,"물약은 전열의 임의의 적에게 +{0}%의 피해를 입히는 암흑 미사일을 시전합니다."]
[101019,"적 공격이 생명력과 보호막을 동시에 감소시키지 않습니다."]
[101020,"즉시 임의의 적에게 저주 효과를 부여해 처치 시 시체 폭파를 일으킵니다."]
[101021,"부활 발동 시 회복되는 생명력이 +{0}% 늘어납니다."]
[101022,"원거리 공격을 받을 때마다 생명력을 {0} 회복합니다."]
[101023,"{0}발의 매직 미사일을 무작위 적에게 즉시 발사합니다."]
[101024,"원거리 공격 회피 시 공격을 반사합니다."]
[101025,"연속 {0}회 회피 성공 시 생명력을 {1} 회복합니다."]
[101026,"근거리 적 공격 회피 시 후열의 적에게 낙뢰 피해를 입힙니다."]
[101027,"전장의 모든 무작위 적에게 생명력을 {0}만큼 흡혈합니다."]
[101028,"후열의 적 공격 시 무작위 적의 생명력을 {0}만큼 흡혈합니다."]
[101029,"원거리 적 공격 회피 시 보호막을 {0}만큼 회복합니다."]
[101030,"{0}번 째 치명타는 +{1}%의 피해를 입힙니다."]
[101031,"{0}번째 공격마다 후열의 적에게 {1}% 피해를 입힙니다."]
[101032,"전투 시작 후 첫 번째 공격은 생명력을 {0} 회복합니다."]
[101033,"전투 시작 후 첫 번째 공격 후 보호막을 {0}% 회복합니다."]
[101034,"물약 보유 시 생명력이 0이 될 때 자동으로 사용합니다."]
[101035,"임의의 성소을 발견하면 골드를 획득합니다."]
[101036,"샘물을 발견 시 최대 HP를 {0}증가 시킵니다."]
[101037,"회복의 샘에서 회복 효과가 발생 될 때 보호막도 동일하게 회복 됩니다."]
[101038,"완전히 회복할 때 보호막을 {0} 회복합니다."]
[101039,"{0}번째 공격이 명중할 때마다 {1}% 피해를 입히는 낙뢰를 시전합니다."]
[101040,"즉시 무작위 고급 또는 희귀 스킬 1개를 획득합니다."]
[101041,"적이 골드를 떨어뜨릴 때마다 생명력을 {0} 회복 시킵니다."]
[101042,"적이 골드를 떨어뜨릴 때마다 임의의 적에게 전기 충격 피해를 입힙니다."]
[101043,"보호막이 0인 상태에서 생명력이 {0}만 남아 있을 경우,. 보호막을 완전 회복합니다."]
[101044,"매 레벨 업 할 때마다 생명력을 {0} 회복합니다."]
[101045,"회복의 샘도 경험치를 제공합니다."]
[101046,"적 {0}명 처치 후 완전 회복(매 전투 당 1회만 발동)"]
[101047,"보호막 소진 시 생명력 {0} 회복"]
[101048,"캠프에서 보호막도 함께 회복됩니다."]
[101049,"원거리 공격에 피격 될 경우 {1}% 확률로 생명력을 {0} 회복합니다."]
[101050,"회복 효과가 발생되면 무작위 적에게 {0}의 신성 피해를 입힙니다."]
[101051,"지금 즉시 생명력을 완전 회복합니다."]
[101052,"비 전투 상태로 던전 탐험 시 {1}초마다 생명력을 {0} 회복합니다."]
[101053,"생명력이 {0}이하일 때 회피 확률이 최대치로 고정됩니다."]
[101054,"적이 골드를 떨어뜨릴 확률이 +{0}% 증가합니다."]
[101055,"일반 또는 고급 스킬을 얻으면 최대 보호막이 {0} 증가합니다."]
[101056,"매 레벨 업 할 때마다 최대 생명력가 {0} 증가합니다."]
[101057,"매 레벨 업 할 때마다 최대 보호막이 {0} 증가합니다."]
[101058,"후열의 적 처치 시 생명력을 {0} 회복합니다."]
[101059,"적 처치 시 임의의 적에게 {0} 피해를 입힙니다."]
[101060,"후열의 적 처치 시 매직 미사일 {0}발을 시전해 무작위 적을 공격합니다."]
[101061,"매 레벨 업 할 때마다 무작위 적 {0}명에게 사신의 낫을 시전해 즉사시킵니다."]
[101062,"{0}번째 치명타 발생 시 피격 된 대상에게 사신의 낫을 시전해 즉사시킵니다."]
[101063,"캠프를 발견할 때마다 즉시 레벨 업합니다."]
[101064,"레벨 업 시 모든 적을 {0}초 동안 기절시킵니다."]
[101065,"레벨 업 시 무작위 적 {0}명에게 저주 효과를 부여하고, 처치 시 시체 폭파를 일으킵니다."]
[101066,"전리품 상자가 회복과 경험치를 제공합니다."]
[101067,"전장에 있는 적 {0}명에게 즉시 저주 효과를 부여하고, 처치 시 시체 폭파를 일으킵니다."]
[101068,"근접 적이 출몰할 때 {0}% 확률로 자신을 공격합니다."]
[101069,"근접 피해를 입힌 적에게 {0}의 신성 피해를 입힌다."]
[101070,"빗나감이 발생되면 다음 공격 피해를 {0}% 증가시킵니다."]
[102001,"치명타 발생 시 다음 치명타 확률이 +{0}% 증가 합니다."]
[102002,"캠프를 방문할 때마다 무작위 일반 스킬을 얻습니다."]
[102003,"모든 근접 적의 피해가 {0} 감소합니다."]
[102004,"모든 원거리 적의 피해가 {0} 감소합니다."]
[102005,"레벨 업 시 보호막이 {0} 회복됩니다."]
[102006,"보호막은 근접 피해를 {0}% 확률로 무효화 합니다."]
[102007,"보호막이 있을 경우, 원거리 공격을 {0}% 확률로 무효화 합니다."]
[102008,"보호막이 있을 경우, 원거리 피해를 {0}% 감소시킵니다."]
[102009,"후열에 있는 적에게 입히는 피해가 +{0}% 만큼 증가합니다."]
[102010,"적 처시 시 모든 피해를 무효화하는 보호막을 {0}초 동안 활성화합니다."]
[103001,"지금 즉시 대량의 골드({0}~{1}G)를 얻을 수 있습니다."]
[103002,"공격 속도가 +{0}% 증가합니다."]
[103003,"원거리 피격 시 다음 공격으로 입히는 피해가 +{0}% 증가합니다."]
[103004,"원거리 적이 공격하는 첫 번째 공격을 무조건 회피합니다."]
[103005,"근접 회피가 +{0}% 증가합니다."]
[103006,"첫 번째 공격은 치명타 확률이 {0}% 증가합니다."]
[103007,"치명타가 발생할 경우, {0}% 확률로 무작위 적에게도 동일한 피해를 입힙니다."]
[103008,"즉시 최대 생명력의 {0}%를 회복하고, 모든 물약을 가득 채웁니다."]
[103009,"물약을 사용하면 모든 적에게 물약으로 회복 된 생명력과 동일한 피해를 입힙니다."]
[103010,"{1}번째 회피마다 최대 공격력이 {0}증가 합니다."]
[104001,"보호막이 있을 경우, 모든 받는 피해가 {0}% 감소됩니다."]
[104002,"원거리 적이 공격할 때 전열의 적이 있을 경우, {0}%의 피해를 입힙니다."]
[104003,"{0}번째 일반 공격에 명중 된 적에게 암흑 미사일 {1}발을 연속 시전합니다."]
[104004,"치명타 발생 시 모든 적을 {0}초 동안 기절시킵니다."]
[104005,"현재 보호막의 {0}%만큼 최대 공격력이 증가합니다."]
[104006,"최대 공격력이 +{0} 증가하고, 적 처치 시 생명력을 추가로 {1} 회복합니다."]
[104007,"일반 공격을 {0}회 명중할 때마다 임의의 적에게 낙뢰를 시전합니다."]
[104008,"{0}번째 일반 공격마다 최대 생명력의 {1}%만큼 회복합니다."]
[104009,"근접 피해를 {0}회 받을 때마다 최대 보호막의 {1}%를 회복합니다."]
[104010,"{0}번째 일반 공격 명중 시 임의의 적에게 범위 피해를 입히는 화염구를 시전합니다."]
[105001,"적에게 입히는 첫 번째 공격은 x{0}배의 피해를 입힙니다."]
[105002,"모든 원거리 피해는 무작위 적에게 반사됩니다."]
[105003,"사망할 경우, {0}% 확률로 부활합니다."]
[105004,"모든 원거리 적은 후열에 있을 경우 눈멀기 상태가 됩니다."]
[105005,"치명타에 명중 된 대상에게 범위 피해를 입히는 화염구를 추가로 시전합니다."]
[105006,"회복 효과가 발생 될 때마다 보호막도 회복됩니다."]
[105007,"적 처치 시 모든 적에게 신비한 폭발 피해를 입힙니다."]
[105008,"최소 공격력과 최대 공격력이 항상 동일하게 적용됩니다."]
[105009,"적 처치 시 후열의 적이 {0}초 동안 기절합니다."]
[105010,"보호막이 활성화 되어있을 경우, 받는 모든 피해를 반사합니다."]
[501011,"어? 이런 곳에서 사람을 만날 줄은 몰랐네! 사냥감인 줄 알고 깜짝 놀랐잖아.","등장 대화 패턴"]
[501012,"너도 이 던전을 탐험 중이야? 반가워."]
[501013,"아, 안녕! 혹시 우리 만난적이 있던가?"]
[501014,"이런 곳에서 모험가를 만나니 조금 안심이 되네. 나, 혼자 있으면 괜히 긴장되거든."]
[501015,"조심해서 다녀! 여긴 소리 없이 다가오는 녀석들이 많아."]
[501016,"혹시 쓸만한 사냥감 본 적 있어? 난 계속 허탕이라서 말이지."]
[{"$f":"A364+10","v":501021},"잠깐! 먼저 공격할 생각은 없었는데… 어쩔 수 없네.","전투 대화 패턴"]
[{"$f":"A365+10","v":501022},"쳇, 당하고 있을 순 없지. 나도 살아야 하니까!"]
[501023,"내가 그렇게 만만해 보였어? 후회하게 해줄게!"]
[501024,"경고했어! 다가오면 쏠 수밖에!"]
[501025,"으… 이런 싸움은 싫은데! 하지만 각오하는게 좋을거야."]
[501026,"후회하게 될 거야…"]
[501031,"그럼 조심해서 가! 여기서 길을 잃으면 큰일 나거든.","NPC 떠날 때 대화 패턴"]
[501032,"다음에 또 만나면 정보도 좀 교환하자고."]
[501033,"나는 좀 더 둘러보고 갈게. 위험한 놈들 조심해!"]
[501034,"이 근처에 수상한 흔적이 많아. 혼자 다니지 않는게 좋을거야."]
[501035,"필요한 거 있으면 언제든 말해줘. 내가 아는 범위 안에서라면!"]
[501036,"부디 무사히 나가길 바라! 난 잠깐 더 조사하고 갈게."]
[501041,"저기… 미안한데 혹시 좀 도와줄 수 있을까?","NPC 선물 요구 대화 패턴"]
[501042,"혹시, 쓸만한게 있으면 좀 나눠줄 수 있어?"]
[501043,"혹시 먹을 것 좀 있어? 사냥감이 없어서 계속 굶었거든…"]
[501044,"불편한 부탁인 건 아는데… 조금만 도와주면 안 될까?"]
[501045,"위험해서 돌아가기도 애매한데… 혹시 쓸만한 도구가 있으면 조금만 빌려줄래?"]
[501046,"이 근처에 몬스터가 너무 많아서 말인데… 혹시 아이템을 조금만 나눠줄 수 있어?"]
[501051,"고마워! 진짜 큰 도움이 됐어. 덕분에 살았다!","NPC 선물 감사 대화 패턴"]
[{"$f":"A383+10","v":501052},"와… 이렇게 챙겨주는 사람 처음 봤어. 꼭 보답할게!"]
[501053,"이걸 나한테? 정말 고마워! 금방 컨디션 찾을 수 있겠다."]
[501054,"아… 덕분에 한숨 놓았어. 이 은혜는 잊지 않을게!"]
[501055,"역시! 너라면 도와줄거라 믿고 있었다고!"]
[501056,"완전 감동했어… 다음에 사냥감 좋은 거 나오면 꼭 나눠줄게!"]
[501061,"아, 괜찮아! 무리한 부탁이었지. 신경 쓰지 마.","NPC 선물 거부 대화 패턴"]
[501062,"아… 알겠어. 어쩔 수 없지 뭐."]
[501063,"미안해, 괜히 귀찮게 했네. 다음엔 내가 더 준비해올게."]
[501064,"괜찮아! 괜히 나 때문에 곤란해지면 안 되니까."]
[501065,"응, 알겠어. 네 물건이니까 당연히 그래야지."]
[501066,"흠… 조금 아쉽긴 하지만 이해해. 부탁받는 것도 부담이잖아."]
[501071,"어...? 지금 내 가방 뒤졌어!? 이 도둑놈!","NPC 훔치기 실패 대화 패턴"]
[501072,"잠깐만! 그건 내 소중한 물건이라고!"]
[501073,"설마… 진짜 훔치려던 거야? 실망이야!"]
[501074,"방금 뭐하려고 했어? 나 이렇게 만만해 보여?"]
[501075,"그건 안 돼! 내 생명줄 같은 거라고!"]
[501076,"착한 녀석이라고 생각했는데… 용서할 수 없어!"]
[501081,"으윽… 결국… 이렇게 되는… 건가…","NPC 죽음 대화 패턴"]
[501082,"내가.. 조금만… 더 강했더라면…"]
[501083,"큭! 사냥… 실패인가… 하…"]
[501084,"커흑… 조, 조심해야… 했는데…"]
[501085,"으윽... 이런… 허무하게… 끝나다니…"]
[501086,"부, 부탁이야… 제발… 자비를…!"]
[{"$f":"A364+1000","v":502011},"NPC 등장 대사1","등장 대화 패턴"]
[{"$f":"A365+1000","v":502012},"NPC 등장 대사2"]
[{"$f":"A366+1000","v":502013},"NPC 등장 대사3"]
[502014,"NPC 등장 대사4"]
[502015,"NPC 등장 대사5"]
[502016,"NPC 등장 대사6"]
[502021,"NPC 전투 대사1","전투 대화 패턴"]
[502022,"NPC 전투 대사2"]
[502023,"NPC 전투 대사3"]
[502024,"NPC 전투 대사4"]
[502025,"NPC 전투 대사5"]
[502026,"NPC 전투 대사6"]
[502031,"NPC 헤어짐 대사1","NPC 떠날 때 대화 패턴"]
[502032,"NPC 헤어짐 대사2"]
[502033,"NPC 헤어짐 대사3"]
[502034,"NPC 헤어짐 대사4"]
[502035,"NPC 헤어짐 대사5"]
[502036,"NPC 헤어짐 대사6"]
[502041,"NPC 선물 요구 대사1","NPC 선물 요구 대화 패턴"]
[502042,"NPC 선물 요구 대사2"]
[502043,"NPC 선물 요구 대사3"]
[502044,"NPC 선물 요구 대사4"]
[502045,"NPC 선물 요구 대사5"]
[502046,"NPC 선물 요구 대사6"]
[502051,"NPC 선물 감사 대사1","NPC 선물 감사 대화 패턴"]
[502052,"NPC 선물 감사 대사2"]
[502053,"NPC 선물 감사 대사3"]
[502054,"NPC 선물 감사 대사4"]
[502055,"NPC 선물 감사 대사5"]
[502056,"NPC 선물 감사 대사6"]
[502061,"NPC 선물 거절 대사1","NPC 선물 거부 대화 패턴"]
[502062,"NPC 선물 거절 대사2"]
[502063,"NPC 선물 거절 대사3"]
[502064,"NPC 선물 거절 대사4"]
[502065,"NPC 선물 거절 대사5"]
[502066,"NPC 선물 거절 대사6"]
[502071,"NPC 훔치기 실패 대사1","NPC 훔치기 실패 대화 패턴"]
[502072,"NPC 훔치기 실패 대사2"]
[502073,"NPC 훔치기 실패 대사3"]
[502074,"NPC 훔치기 실패 대사4"]
[502075,"NPC 훔치기 실패 대사5"]
[502076,"NPC 훔치기 실패 대사6"]
[502081,"NPC 죽을 때 대사1","NPC 죽음 대화 패턴"]
[502082,"NPC 죽을 때 대사2"]
[502083,"NPC 죽을 때 대사3"]
[502084,"NPC 죽을 때 대사4"]
[502085,"NPC 죽을 때 대사5"]
[502086,"NPC 죽을 때 대사6"]
[{"$f":"A412+1000","v":503011},"NPC 등장 대사1","등장 대화 패턴"]
[{"$f":"A413+1000","v":503012},"NPC 등장 대사2"]
[{"$f":"A414+1000","v":503013},"NPC 등장 대사3"]
[503014,"NPC 등장 대사4"]
[503015,"NPC 등장 대사5"]
[503016,"NPC 등장 대사6"]
[503021,"NPC 전투 대사1","전투 대화 패턴"]
[503022,"NPC 전투 대사2"]
[503023,"NPC 전투 대사3"]
[503024,"NPC 전투 대사4"]
[503025,"NPC 전투 대사5"]
[503026,"NPC 전투 대사6"]
[503031,"NPC 헤어짐 대사1","NPC 떠날 때 대화 패턴"]
[503032,"NPC 헤어짐 대사2"]
[503033,"NPC 헤어짐 대사3"]
[503034,"NPC 헤어짐 대사4"]
[503035,"NPC 헤어짐 대사5"]
[503036,"NPC 헤어짐 대사6"]
[503041,"NPC 선물 요구 대사1","NPC 선물 요구 대화 패턴"]
[503042,"NPC 선물 요구 대사2"]
[503043,"NPC 선물 요구 대사3"]
[503044,"NPC 선물 요구 대사4"]
[503045,"NPC 선물 요구 대사5"]
[503046,"NPC 선물 요구 대사6"]
[503051,"NPC 선물 감사 대사1","NPC 선물 감사 대화 패턴"]
[503052,"NPC 선물 감사 대사2"]
[503053,"NPC 선물 감사 대사3"]
[503054,"NPC 선물 감사 대사4"]
[503055,"NPC 선물 감사 대사5"]
[503056,"NPC 선물 감사 대사6"]
[503061,"NPC 선물 거절 대사1","NPC 선물 거부 대화 패턴"]
[503062,"NPC 선물 거절 대사2"]
[503063,"NPC 선물 거절 대사3"]
[503064,"NPC 선물 거절 대사4"]
[503065,"NPC 선물 거절 대사5"]
[503066,"NPC 선물 거절 대사6"]
[503071,"NPC 훔치기 실패 대사1","NPC 훔치기 실패 대화 패턴"]
[503072,"NPC 훔치기 실패 대사2"]
[503073,"NPC 훔치기 실패 대사3"]
[503074,"NPC 훔치기 실패 대사4"]
[503075,"NPC 훔치기 실패 대사5"]
[503076,"NPC 훔치기 실패 대사6"]
[503081,"NPC 죽을 때 대사1","NPC 죽음 대화 패턴"]
[503082,"NPC 죽을 때 대사2"]
[503083,"NPC 죽을 때 대사3"]
[503084,"NPC 죽을 때 대사4"]
[503085,"NPC 죽을 때 대사5"]
[503086,"NPC 죽을 때 대사6"]
[{"$f":"A460+1000","v":504011},"NPC 등장 대사1","등장 대화 패턴"]
[{"$f":"A461+1000","v":504012},"NPC 등장 대사2"]
[{"$f":"A462+1000","v":504013},"NPC 등장 대사3"]
[504014,"NPC 등장 대사4"]
[504015,"NPC 등장 대사5"]
[504016,"NPC 등장 대사6"]
[504021,"NPC 전투 대사1","전투 대화 패턴"]
[504022,"NPC 전투 대사2"]
[504023,"NPC 전투 대사3"]
[504024,"NPC 전투 대사4"]
[504025,"NPC 전투 대사5"]
[504026,"NPC 전투 대사6"]
[504031,"NPC 헤어짐 대사1","NPC 떠날 때 대화 패턴"]
[504032,"NPC 헤어짐 대사2"]
[504033,"NPC 헤어짐 대사3"]
[504034,"NPC 헤어짐 대사4"]
[504035,"NPC 헤어짐 대사5"]
[504036,"NPC 헤어짐 대사6"]
[504041,"NPC 선물 요구 대사1","NPC 선물 요구 대화 패턴"]
[504042,"NPC 선물 요구 대사2"]
[504043,"NPC 선물 요구 대사3"]
[504044,"NPC 선물 요구 대사4"]
[504045,"NPC 선물 요구 대사5"]
[504046,"NPC 선물 요구 대사6"]
[504051,"NPC 선물 감사 대사1","NPC 선물 감사 대화 패턴"]
[504052,"NPC 선물 감사 대사2"]
[504053,"NPC 선물 감사 대사3"]
[504054,"NPC 선물 감사 대사4"]
[504055,"NPC 선물 감사 대사5"]
[504056,"NPC 선물 감사 대사6"]
[504061,"NPC 선물 거절 대사1","NPC 선물 거부 대화 패턴"]
[504062,"NPC 선물 거절 대사2"]
[504063,"NPC 선물 거절 대사3"]
[504064,"NPC 선물 거절 대사4"]
[504065,"NPC 선물 거절 대사5"]
[504066,"NPC 선물 거절 대사6"]
[504071,"NPC 훔치기 실패 대사1","NPC 훔치기 실패 대화 패턴"]
[504072,"NPC 훔치기 실패 대사2"]
[504073,"NPC 훔치기 실패 대사3"]
[504074,"NPC 훔치기 실패 대사4"]
[504075,"NPC 훔치기 실패 대사5"]
[504076,"NPC 훔치기 실패 대사6"]
[504081,"NPC 죽을 때 대사1","NPC 죽음 대화 패턴"]
[504082,"NPC 죽을 때 대사2"]
[504083,"NPC 죽을 때 대사3"]
[504084,"NPC 죽을 때 대사4"]
[504085,"NPC 죽을 때 대사5"]
[504086,"NPC 죽을 때 대사6"]
[{"$f":"A508+1000","v":505011},"NPC 등장 대사1","등장 대화 패턴"]
[{"$f":"A509+1000","v":505012},"NPC 등장 대사2"]
[{"$f":"A510+1000","v":505013},"NPC 등장 대사3"]
[505014,"NPC 등장 대사4"]
[505015,"NPC 등장 대사5"]
[505016,"NPC 등장 대사6"]
[505021,"NPC 전투 대사1","전투 대화 패턴"]
[505022,"NPC 전투 대사2"]
[505023,"NPC 전투 대사3"]
[505024,"NPC 전투 대사4"]
[505025,"NPC 전투 대사5"]
[505026,"NPC 전투 대사6"]
[505031,"NPC 헤어짐 대사1","NPC 떠날 때 대화 패턴"]
[505032,"NPC 헤어짐 대사2"]
[505033,"NPC 헤어짐 대사3"]
[505034,"NPC 헤어짐 대사4"]
[505035,"NPC 헤어짐 대사5"]
[505036,"NPC 헤어짐 대사6"]
[505041,"NPC 선물 요구 대사1","NPC 선물 요구 대화 패턴"]
[505042,"NPC 선물 요구 대사2"]
[505043,"NPC 선물 요구 대사3"]
[505044,"NPC 선물 요구 대사4"]
[505045,"NPC 선물 요구 대사5"]
[505046,"NPC 선물 요구 대사6"]
[505051,"NPC 선물 감사 대사1","NPC 선물 감사 대화 패턴"]
[505052,"NPC 선물 감사 대사2"]
[505053,"NPC 선물 감사 대사3"]
[505054,"NPC 선물 감사 대사4"]
[505055,"NPC 선물 감사 대사5"]
[505056,"NPC 선물 감사 대사6"]
[505061,"NPC 선물 거절 대사1","NPC 선물 거부 대화 패턴"]
[505062,"NPC 선물 거절 대사2"]
[505063,"NPC 선물 거절 대사3"]
[505064,"NPC 선물 거절 대사4"]
[505065,"NPC 선물 거절 대사5"]
[505066,"NPC 선물 거절 대사6"]
[505071,"NPC 훔치기 실패 대사1","NPC 훔치기 실패 대화 패턴"]
[505072,"NPC 훔치기 실패 대사2"]
[505073,"NPC 훔치기 실패 대사3"]
[505074,"NPC 훔치기 실패 대사4"]
[505075,"NPC 훔치기 실패 대사5"]
[505076,"NPC 훔치기 실패 대사6"]
[505081,"NPC 죽을 때 대사1","NPC 죽음 대화 패턴"]
[505082,"NPC 죽을 때 대사2"]
[505083,"NPC 죽을 때 대사3"]
[505084,"NPC 죽을 때 대사4"]
[505085,"NPC 죽을 때 대사5"]
[505086,"NPC 죽을 때 대사6"]
[{"$f":"A556+1000","v":506011},"NPC 등장 대사1","등장 대화 패턴"]
[{"$f":"A557+1000","v":506012},"NPC 등장 대사2"]
[{"$f":"A558+1000","v":506013},"NPC 등장 대사3"]
[506014,"NPC 등장 대사4"]
[506015,"NPC 등장 대사5"]
[506016,"NPC 등장 대사6"]
[506021,"NPC 전투 대사1","전투 대화 패턴"]
[506022,"NPC 전투 대사2"]
[506023,"NPC 전투 대사3"]
[506024,"NPC 전투 대사4"]
[506025,"NPC 전투 대사5"]
[506026,"NPC 전투 대사6"]
[506031,"NPC 헤어짐 대사1","NPC 떠날 때 대화 패턴"]
[506032,"NPC 헤어짐 대사2"]
[506033,"NPC 헤어짐 대사3"]
[506034,"NPC 헤어짐 대사4"]
[506035,"NPC 헤어짐 대사5"]
[506036,"NPC 헤어짐 대사6"]
[506041,"NPC 선물 요구 대사1","NPC 선물 요구 대화 패턴"]
[506042,"NPC 선물 요구 대사2"]
[506043,"NPC 선물 요구 대사3"]
[506044,"NPC 선물 요구 대사4"]
[506045,"NPC 선물 요구 대사5"]
[506046,"NPC 선물 요구 대사6"]
[506051,"NPC 선물 감사 대사1","NPC 선물 감사 대화 패턴"]
[506052,"NPC 선물 감사 대사2"]
[506053,"NPC 선물 감사 대사3"]
[506054,"NPC 선물 감사 대사4"]
[506055,"NPC 선물 감사 대사5"]
[506056,"NPC 선물 감사 대사6"]
[506061,"NPC 선물 거절 대사1","NPC 선물 거부 대화 패턴"]
[506062,"NPC 선물 거절 대사2"]
[506063,"NPC 선물 거절 대사3"]
[506064,"NPC 선물 거절 대사4"]
[506065,"NPC 선물 거절 대사5"]
[506066,"NPC 선물 거절 대사6"]
[506071,"NPC 훔치기 실패 대사1","NPC 훔치기 실패 대화 패턴"]
[506072,"NPC 훔치기 실패 대사2"]
[506073,"NPC 훔치기 실패 대사3"]
[506074,"NPC 훔치기 실패 대사4"]
[506075,"NPC 훔치기 실패 대사5"]
[506076,"NPC 훔치기 실패 대사6"]
[506081,"NPC 죽을 때 대사1","NPC 죽음 대화 패턴"]
[506082,"NPC 죽을 때 대사2"]
[506083,"NPC 죽을 때 대사3"]
[506084,"NPC 죽을 때 대사4"]
[506085,"NPC 죽을 때 대사5"]
[506086,"NPC 죽을 때 대사6"]
[{"$f":"A604+1000","v":507011},"NPC 등장 대사1","등장 대화 패턴"]
[{"$f":"A605+1000","v":507012},"NPC 등장 대사2"]
[{"$f":"A606+1000","v":507013},"NPC 등장 대사3"]
[507014,"NPC 등장 대사4"]
[507015,"NPC 등장 대사5"]
[507016,"NPC 등장 대사6"]
[507021,"NPC 전투 대사1","전투 대화 패턴"]
[507022,"NPC 전투 대사2"]
[507023,"NPC 전투 대사3"]
[507024,"NPC 전투 대사4"]
[507025,"NPC 전투 대사5"]
[507026,"NPC 전투 대사6"]
[507031,"NPC 헤어짐 대사1","NPC 떠날 때 대화 패턴"]
[507032,"NPC 헤어짐 대사2"]
[507033,"NPC 헤어짐 대사3"]
[507034,"NPC 헤어짐 대사4"]
[507035,"NPC 헤어짐 대사5"]
[507036,"NPC 헤어짐 대사6"]
[507041,"NPC 선물 요구 대사1","NPC 선물 요구 대화 패턴"]
[507042,"NPC 선물 요구 대사2"]
[507043,"NPC 선물 요구 대사3"]
[507044,"NPC 선물 요구 대사4"]
[507045,"NPC 선물 요구 대사5"]
[507046,"NPC 선물 요구 대사6"]
[507051,"NPC 선물 감사 대사1","NPC 선물 감사 대화 패턴"]
[507052,"NPC 선물 감사 대사2"]
[507053,"NPC 선물 감사 대사3"]
[507054,"NPC 선물 감사 대사4"]
[507055,"NPC 선물 감사 대사5"]
[507056,"NPC 선물 감사 대사6"]
[507061,"NPC 선물 거절 대사1","NPC 선물 거부 대화 패턴"]
[507062,"NPC 선물 거절 대사2"]
[507063,"NPC 선물 거절 대사3"]
[507064,"NPC 선물 거절 대사4"]
[507065,"NPC 선물 거절 대사5"]
[507066,"NPC 선물 거절 대사6"]
[507071,"NPC 훔치기 실패 대사1","NPC 훔치기 실패 대화 패턴"]
[507072,"NPC 훔치기 실패 대사2"]
[507073,"NPC 훔치기 실패 대사3"]
[507074,"NPC 훔치기 실패 대사4"]
[507075,"NPC 훔치기 실패 대사5"]
[507076,"NPC 훔치기 실패 대사6"]
[507081,"NPC 죽을 때 대사1","NPC 죽음 대화 패턴"]
[507082,"NPC 죽을 때 대사2"]
[507083,"NPC 죽을 때 대사3"]
[507084,"NPC 죽을 때 대사4"]
[507085,"NPC 죽을 때 대사5"]
[507086,"NPC 죽을 때 대사6"]
[{"$f":"A652+1000","v":508011},"NPC 등장 대사1","등장 대화 패턴"]
[{"$f":"A653+1000","v":508012},"NPC 등장 대사2"]
[{"$f":"A654+1000","v":508013},"NPC 등장 대사3"]
[508014,"NPC 등장 대사4"]
[508015,"NPC 등장 대사5"]
[508016,"NPC 등장 대사6"]
[508021,"NPC 전투 대사1","전투 대화 패턴"]
[508022,"NPC 전투 대사2"]
[508023,"NPC 전투 대사3"]
[508024,"NPC 전투 대사4"]
[508025,"NPC 전투 대사5"]
[508026,"NPC 전투 대사6"]
[508031,"NPC 헤어짐 대사1","NPC 떠날 때 대화 패턴"]
[508032,"NPC 헤어짐 대사2"]
[508033,"NPC 헤어짐 대사3"]
[508034,"NPC 헤어짐 대사4"]
[508035,"NPC 헤어짐 대사5"]
[508036,"NPC 헤어짐 대사6"]
[508041,"NPC 선물 요구 대사1","NPC 선물 요구 대화 패턴"]
[508042,"NPC 선물 요구 대사2"]
[508043,"NPC 선물 요구 대사3"]
[508044,"NPC 선물 요구 대사4"]
[508045,"NPC 선물 요구 대사5"]
[508046,"NPC 선물 요구 대사6"]
[508051,"NPC 선물 감사 대사1","NPC 선물 감사 대화 패턴"]
[508052,"NPC 선물 감사 대사2"]
[508053,"NPC 선물 감사 대사3"]
[508054,"NPC 선물 감사 대사4"]
[508055,"NPC 선물 감사 대사5"]
[508056,"NPC 선물 감사 대사6"]
[508061,"NPC 선물 거절 대사1","NPC 선물 거부 대화 패턴"]
[508062,"NPC 선물 거절 대사2"]
[508063,"NPC 선물 거절 대사3"]
[508064,"NPC 선물 거절 대사4"]
[508065,"NPC 선물 거절 대사5"]
[508066,"NPC 선물 거절 대사6"]
[508071,"NPC 훔치기 실패 대사1","NPC 훔치기 실패 대화 패턴"]
[508072,"NPC 훔치기 실패 대사2"]
[508073,"NPC 훔치기 실패 대사3"]
[508074,"NPC 훔치기 실패 대사4"]
[508075,"NPC 훔치기 실패 대사5"]
[508076,"NPC 훔치기 실패 대사6"]
[508081,"NPC 죽을 때 대사1","NPC 죽음 대화 패턴"]
[508082,"NPC 죽을 때 대사2"]
[508083,"NPC 죽을 때 대사3"]
[508084,"NPC 죽을 때 대사4"]
[508085,"NPC 죽을 때 대사5"]
[508086,"NPC 죽을 때 대사6"]
[{"$f":"A700+1000","v":509011},"NPC 등장 대사1","등장 대화 패턴"]
[{"$f":"A701+1000","v":509012},"NPC 등장 대사2"]
[{"$f":"A702+1000","v":509013},"NPC 등장 대사3"]
[509014,"NPC 등장 대사4"]
[509015,"NPC 등장 대사5"]
[509016,"NPC 등장 대사6"]
[509021,"NPC 전투 대사1","전투 대화 패턴"]
[509022,"NPC 전투 대사2"]
[509023,"NPC 전투 대사3"]
[509024,"NPC 전투 대사4"]
[509025,"NPC 전투 대사5"]
[509026,"NPC 전투 대사6"]
[509031,"NPC 헤어짐 대사1","NPC 떠날 때 대화 패턴"]
[509032,"NPC 헤어짐 대사2"]
[509033,"NPC 헤어짐 대사3"]
[509034,"NPC 헤어짐 대사4"]
[509035,"NPC 헤어짐 대사5"]
[509036,"NPC 헤어짐 대사6"]
[509041,"NPC 선물 요구 대사1","NPC 선물 요구 대화 패턴"]
[509042,"NPC 선물 요구 대사2"]
[509043,"NPC 선물 요구 대사3"]
[509044,"NPC 선물 요구 대사4"]
[509045,"NPC 선물 요구 대사5"]
[509046,"NPC 선물 요구 대사6"]
[509051,"NPC 선물 감사 대사1","NPC 선물 감사 대화 패턴"]
[509052,"NPC 선물 감사 대사2"]
[509053,"NPC 선물 감사 대사3"]
[509054,"NPC 선물 감사 대사4"]
[509055,"NPC 선물 감사 대사5"]
[509056,"NPC 선물 감사 대사6"]
[509061,"NPC 선물 거절 대사1","NPC 선물 거부 대화 패턴"]
[509062,"NPC 선물 거절 대사2"]
[509063,"NPC 선물 거절 대사3"]
[509064,"NPC 선물 거절 대사4"]
[509065,"NPC 선물 거절 대사5"]
[509066,"NPC 선물 거절 대사6"]
[509071,"NPC 훔치기 실패 대사1","NPC 훔치기 실패 대화 패턴"]
[509072,"NPC 훔치기 실패 대사2"]
[509073,"NPC 훔치기 실패 대사3"]
[509074,"NPC 훔치기 실패 대사4"]
[509075,"NPC 훔치기 실패 대사5"]
[509076,"NPC 훔치기 실패 대사6"]
[509081,"NPC 죽을 때 대사1","NPC 죽음 대화 패턴"]
[509082,"NPC 죽을 때 대사2"]
[509083,"NPC 죽을 때 대사3"]
[509084,"NPC 죽을 때 대사4"]
[509085,"NPC 죽을 때 대사5"]
[509086,"NPC 죽을 때 대사6"]
[601011,"어머, 손님인가 보네? 이 던전에서 장사하는 건 위험하지만… 수요는 확실하거든.","등장 대화 패턴"]
[601012,"왔군요. 모험가님들 덕에 제 장사도 돌아가는 거예요."]
[601013,"왠지 넌 돈이 좀 있어보이는데? 아니면 혹시 오늘 탐험 수확이 좋았어?"]
[601014,"탐험하느라 고생이 많지? 자, 필요한 게 있는지 한번 둘러봐."]
[601015,"아, 반가워. 이 근처에서 살 만한 물건은 나만큼 갖춘 사람은 없을걸?"]
[601016,"오호, 거래할 생각이 가득한 얼굴이네. 아주 마음에 들어."]
[{"$f":"A796+10","v":601021},"하아... 결국 이렇게 나오는 거야? 너, 상대로 잘못 골랐어.","전투 대화 패턴"]
[{"$f":"A797+10","v":601022},"흥, 내가 장사만 하는 줄 알았어? 물건을 지키려면 실력도 있어야 하거든."]
[601023,"쳇, 시체는 취급 안하는데… 내게 덤빈 댓가는 네 물건들로 계산할게."]
[601024,"흥, 내게 덤비다니. 본전도 못 건질 텐데?"]
[601025,"피해 보상할 돈은 가지고 있겠지? 그 건방진 표정이 얼마나 더 갈지 지켜보겠어. "]
[601026,"전투는 원치 않지만… 내 물건에 손대려는 사람에겐 예외지."]
[601031,"다음에 올 때는 지갑 두둑하게 챙겨와. 빈털털이 손님은 별로니까.","상인이 떠날 때 대화 패턴"]
[601032,"거래 끝났으면 조심해서 돌아가. 여기선 금화보다 목숨이 더 귀하니까."]
[601033,"나도 이만 가야겠네. 혹시 또 필요하면 날 찾아오도록 해."]
[601034,"언제든 찾아와도 좋아. 단, 흥정은 짧고 계산은 확실하게."]
[601035,"그럼, 행운을 빌게. 던전에선 그게 제일 비싸거든. 안녕!"]
[601036,"다음에 만날 땐 더 좋은 상품을 준비해둘게. 뭐, 기대해도 좋아."]
[601041,"자자, 한번 골라봐. 다른 데선 구경도 못 할 물건들이거든.","상인이 판매중인 상품을 보여줄 때"]
[601042,"이건 조금 비싸지만… 값어치를 할 거야. 목숨보다 싼 건 없잖아?"]
[601043,"이미 많이 할인 된 가격이라... 흥정은 사양할게."]
[601044,"혹시, 원하는 게 있으면 말해봐. 다음번에는 미리 준비해 둘테니까."]
[601045,"이건, 요즘 잘 나가는 물건들이야. 내가 파는 물건중에 짝퉁은 없으니까 안심 해."]
[601046,"천천히 골라봐. 어차피 이런 곳에서는 결국 살 게 정해져 있을테니까."]
[601051,"현명한 선택이이야. 네가 이곳에서 생존할 확율이 아주 많이 상승했을 걸?","플레이어가 상품을 구매했을 때"]
[{"$f":"A815+10","v":601052},"좋아, 거래 완료! 너 같은 손님만 있으면 금방 부자 되겠네~"]
[601053,"훌륭한 결정이야. 절대 후회할 일은 없을 거야."]
[601054,"고마워. 그 물건, 쓰면 쓸수록 나중엔 나한테 감사하게 될거야."]
[601055,"가격은 좀 있지만… 그만큼 품질은 믿어도 돼. 내가 보장할게."]
[601056,"좋아, 계산은 끝났어. 이런 곳에서 살아남고 싶으면 이 정도 투자는 기본이라구."]
[601061,"그래? 좋아. 네 고생만 늘겠지. 뭐, 결국 다시 날 찾게 될거야.","상인 거래 거부 대화 패턴"]
[601062,"싸구려 선택을 했다고 후회하지 않길 바랄게."]
[601063,"흠… 돈을 아끼는 건 좋은데, 목숨까지 아끼진 말아야지?"]
[601064,"그래, 하지만 나중에 가격 올라도 후회하진 말아."]
[601065,"지금은 패스라는 거지? 뭐, 좋아. 하지만 이란 기회는 흔치 않을거야."]
[601066,"뭐, 좋아. 상품에 관심 없는 손님에겐 나도 더 이상 볼일 없으니까."]
[601071,"지금… 뭐 하는 거야? 안타깝지만 니 손보다 내 눈이 더 빨라서 말이야.","상인 훔치기 실패 대화 패턴"]
[601072,"흥, 도둑질? 참~ 용감하네. 아직까지 살아남은게 궁금할 지경이야."]
[601073,"그 손… 당장 떼! 안 그러면 손목을 날려버리겠어."]
[601074,"하아~ 이런 건 거래라고 하지 않아. 도둑질이라고 하지!"]
[601075,"내 물건 훔치려는 순간부터, 더 이상 넌 손님이 아니야."]
[601076,"무례한 손님이네? 그런데 이런 짓을 할 땐 목숨 정돈 걸어야겠지?"]
[601081,"으흑… 내 사업이… 여기서 끝인가…","상인 죽음 대화 패턴"]
[601082,"큭, 이런 끝을 맞다니… 계산… 착오… 였어…"]
[601083,"읏… 손해만 본 거래였네… 당신만… 남았으니…"]
[601084,"역시… 오늘 일진이… 사납더라니… 크읏!"]
[601085,"크윽… 이래서… 진상 손님은 받는 게… 아닌데…"]
[601086,"내, 내 돈… 아직… 쓰지도 못했는데…"]
[{"$f":"A796+1000","v":602011},"상인 등장 대사1","등장 대화 패턴"]
[{"$f":"A797+1000","v":602012},"상인 등장 대사2"]
[{"$f":"A798+1000","v":602013},"상인 등장 대사3"]
[602014,"상인 등장 대사4"]
[602015,"상인 등장 대사5"]
[602016,"상인 등장 대사6"]
[602021,"상인 전투 대사1","전투 대화 패턴"]
[602022,"상인 전투 대사2"]
[602023,"상인 전투 대사3"]
[602024,"상인 전투 대사4"]
[602025,"상인 전투 대사5"]
[602026,"상인 전투 대사6"]
[602031,"상인 헤어짐 대사1","상인이 떠날 때 대화 패턴"]
[602032,"상인 헤어짐 대사2"]
[602033,"상인 헤어짐 대사3"]
[602034,"상인 헤어짐 대사4"]
[602035,"상인 헤어짐 대사5"]
[602036,"상인 헤어짐 대사6"]
[602041,"상인이 판매중인 상품을 보여줄 때 대사1","상인이 판매중인 상품을 보여줄 때"]
[602042,"상인이 판매중인 상품을 보여줄 때 대사2"]
[602043,"상인이 판매중인 상품을 보여줄 때 대사3"]
[602044,"상인이 판매중인 상품을 보여줄 때 대사4"]
[602045,"상인이 판매중인 상품을 보여줄 때 대사5"]
[602046,"상인이 판매중인 상품을 보여줄 때 대사6"]
[602051,"플레이어가 상품을 구매했을 때 대사1","플레이어가 상품을 구매했을 때"]
[602052,"플레이어가 상품을 구매했을 때 대사2"]
[602053,"플레이어가 상품을 구매했을 때 대사3"]
[602054,"플레이어가 상품을 구매했을 때 대사4"]
[602055,"플레이어가 상품을 구매했을 때 대사5"]
[602056,"플레이어가 상품을 구매했을 때 대사6"]
[602061,"상인 거래 거부 대화 패턴 대사1","상인 거래 거부 대화 패턴"]
[602062,"상인 거래 거부 대화 패턴 대사2"]
[602063,"상인 거래 거부 대화 패턴 대사3"]
[602064,"상인 거래 거부 대화 패턴 대사4"]
[602065,"상인 거래 거부 대화 패턴 대사5"]
[602066,"상인 거래 거부 대화 패턴 대사6"]
[602071,"상인 훔치기 실패 대사1","상인 훔치기 실패 대화 패턴"]
[602072,"상인 훔치기 실패 대사2"]
[602073,"상인 훔치기 실패 대사3"]
[602074,"상인 훔치기 실패 대사4"]
[602075,"상인 훔치기 실패 대사5"]
[602076,"상인 훔치기 실패 대사6"]
[602081,"상인 죽을 때 대사1","상인 죽음 대화 패턴"]
[602082,"상인 죽을 때 대사2"]
[602083,"상인 죽을 때 대사3"]
[602084,"상인 죽을 때 대사4"]
[602085,"상인 죽을 때 대사5"]
[602086,"상인 죽을 때 대사6"]
[{"$f":"A844+1000","v":603011},"상인 등장 대사1","등장 대화 패턴"]
[{"$f":"A845+1000","v":603012},"상인 등장 대사2"]
[{"$f":"A846+1000","v":603013},"상인 등장 대사3"]
[603014,"상인 등장 대사4"]
[603015,"상인 등장 대사5"]
[603016,"상인 등장 대사6"]
[603021,"상인 전투 대사1","전투 대화 패턴"]
[603022,"상인 전투 대사2"]
[603023,"상인 전투 대사3"]
[603024,"상인 전투 대사4"]
[603025,"상인 전투 대사5"]
[603026,"상인 전투 대사6"]
[603031,"상인 헤어짐 대사1","상인이 떠날 때 대화 패턴"]
[603032,"상인 헤어짐 대사2"]
[603033,"상인 헤어짐 대사3"]
[603034,"상인 헤어짐 대사4"]
[603035,"상인 헤어짐 대사5"]
[603036,"상인 헤어짐 대사6"]
[603041,"상인이 판매중인 상품을 보여줄 때 대사1","상인이 판매중인 상품을 보여줄 때"]
[603042,"상인이 판매중인 상품을 보여줄 때 대사2"]
[603043,"상인이 판매중인 상품을 보여줄 때 대사3"]
[603044,"상인이 판매중인 상품을 보여줄 때 대사4"]
[603045,"상인이 판매중인 상품을 보여줄 때 대사5"]
[603046,"상인이 판매중인 상품을 보여줄 때 대사6"]
[603051,"플레이어가 상품을 구매했을 때 대사1","플레이어가 상품을 구매했을 때"]
[603052,"플레이어가 상품을 구매했을 때 대사2"]
[603053,"플레이어가 상품을 구매했을 때 대사3"]
[603054,"플레이어가 상품을 구매했을 때 대사4"]
[603055,"플레이어가 상품을 구매했을 때 대사5"]
[603056,"플레이어가 상품을 구매했을 때 대사6"]
[603061,"상인 거래 거부 대화 패턴 대사1","상인 거래 거부 대화 패턴"]
[603062,"상인 거래 거부 대화 패턴 대사2"]
[603063,"상인 거래 거부 대화 패턴 대사3"]
[603064,"상인 거래 거부 대화 패턴 대사4"]
[603065,"상인 거래 거부 대화 패턴 대사5"]
[603066,"상인 거래 거부 대화 패턴 대사6"]
[603071,"상인 훔치기 실패 대사1","상인 훔치기 실패 대화 패턴"]
[603072,"상인 훔치기 실패 대사2"]
[603073,"상인 훔치기 실패 대사3"]
[603074,"상인 훔치기 실패 대사4"]
[603075,"상인 훔치기 실패 대사5"]
[603076,"상인 훔치기 실패 대사6"]
[603081,"상인 죽을 때 대사1","상인 죽음 대화 패턴"]
[603082,"상인 죽을 때 대사2"]
[603083,"상인 죽을 때 대사3"]
[603084,"상인 죽을 때 대사4"]
[603085,"상인 죽을 때 대사5"]
[603086,"상인 죽을 때 대사6"]
[{"$f":"A892+1000","v":604011},"상인 등장 대사1","등장 대화 패턴"]
[{"$f":"A893+1000","v":604012},"상인 등장 대사2"]
[{"$f":"A894+1000","v":604013},"상인 등장 대사3"]
[604014,"상인 등장 대사4"]
[604015,"상인 등장 대사5"]
[604016,"상인 등장 대사6"]
[604021,"상인 전투 대사1","전투 대화 패턴"]
[604022,"상인 전투 대사2"]
[604023,"상인 전투 대사3"]
[604024,"상인 전투 대사4"]
[604025,"상인 전투 대사5"]
[604026,"상인 전투 대사6"]
[604031,"상인 헤어짐 대사1","상인이 떠날 때 대화 패턴"]
[604032,"상인 헤어짐 대사2"]
[604033,"상인 헤어짐 대사3"]
[604034,"상인 헤어짐 대사4"]
[604035,"상인 헤어짐 대사5"]
[604036,"상인 헤어짐 대사6"]
[604041,"상인이 판매중인 상품을 보여줄 때 대사1","상인이 판매중인 상품을 보여줄 때"]
[604042,"상인이 판매중인 상품을 보여줄 때 대사2"]
[604043,"상인이 판매중인 상품을 보여줄 때 대사3"]
[604044,"상인이 판매중인 상품을 보여줄 때 대사4"]
[604045,"상인이 판매중인 상품을 보여줄 때 대사5"]
[604046,"상인이 판매중인 상품을 보여줄 때 대사6"]
[604051,"플레이어가 상품을 구매했을 때 대사1","플레이어가 상품을 구매했을 때"]
[604052,"플레이어가 상품을 구매했을 때 대사2"]
[604053,"플레이어가 상품을 구매했을 때 대사3"]
[604054,"플레이어가 상품을 구매했을 때 대사4"]
[604055,"플레이어가 상품을 구매했을 때 대사5"]
[604056,"플레이어가 상품을 구매했을 때 대사6"]
[604061,"상인 거래 거부 대화 패턴 대사1","상인 거래 거부 대화 패턴"]
[604062,"상인 거래 거부 대화 패턴 대사2"]
[604063,"상인 거래 거부 대화 패턴 대사3"]
[604064,"상인 거래 거부 대화 패턴 대사4"]
[604065,"상인 거래 거부 대화 패턴 대사5"]
[604066,"상인 거래 거부 대화 패턴 대사6"]
[604071,"상인 훔치기 실패 대사1","상인 훔치기 실패 대화 패턴"]
[604072,"상인 훔치기 실패 대사2"]
[604073,"상인 훔치기 실패 대사3"]
[604074,"상인 훔치기 실패 대사4"]
[604075,"상인 훔치기 실패 대사5"]
[604076,"상인 훔치기 실패 대사6"]
[604081,"상인 죽을 때 대사1","상인 죽음 대화 패턴"]
[604082,"상인 죽을 때 대사2"]
[604083,"상인 죽을 때 대사3"]
[604084,"상인 죽을 때 대사4"]
[604085,"상인 죽을 때 대사5"]
[604086,"상인 죽을 때 대사6"]
[{"$f":"A940+1000","v":605011},"상인 등장 대사1","등장 대화 패턴"]
[{"$f":"A941+1000","v":605012},"상인 등장 대사2"]
[{"$f":"A942+1000","v":605013},"상인 등장 대사3"]
[605014,"상인 등장 대사4"]
[605015,"상인 등장 대사5"]
[605016,"상인 등장 대사6"]
[605021,"상인 전투 대사1","전투 대화 패턴"]
[605022,"상인 전투 대사2"]
[605023,"상인 전투 대사3"]
[605024,"상인 전투 대사4"]
[605025,"상인 전투 대사5"]
[605026,"상인 전투 대사6"]
[605031,"상인 헤어짐 대사1","상인이 떠날 때 대화 패턴"]
[605032,"상인 헤어짐 대사2"]
[605033,"상인 헤어짐 대사3"]
[605034,"상인 헤어짐 대사4"]
[605035,"상인 헤어짐 대사5"]
[605036,"상인 헤어짐 대사6"]
[605041,"상인이 판매중인 상품을 보여줄 때 대사1","상인이 판매중인 상품을 보여줄 때"]
[605042,"상인이 판매중인 상품을 보여줄 때 대사2"]
[605043,"상인이 판매중인 상품을 보여줄 때 대사3"]
[605044,"상인이 판매중인 상품을 보여줄 때 대사4"]
[605045,"상인이 판매중인 상품을 보여줄 때 대사5"]
[605046,"상인이 판매중인 상품을 보여줄 때 대사6"]
[605051,"플레이어가 상품을 구매했을 때 대사1","플레이어가 상품을 구매했을 때"]
[605052,"플레이어가 상품을 구매했을 때 대사2"]
[605053,"플레이어가 상품을 구매했을 때 대사3"]
[605054,"플레이어가 상품을 구매했을 때 대사4"]
[605055,"플레이어가 상품을 구매했을 때 대사5"]
[605056,"플레이어가 상품을 구매했을 때 대사6"]
[605061,"상인 거래 거부 대화 패턴 대사1","상인 거래 거부 대화 패턴"]
[605062,"상인 거래 거부 대화 패턴 대사2"]
[605063,"상인 거래 거부 대화 패턴 대사3"]
[605064,"상인 거래 거부 대화 패턴 대사4"]
[605065,"상인 거래 거부 대화 패턴 대사5"]
[605066,"상인 거래 거부 대화 패턴 대사6"]
[605071,"상인 훔치기 실패 대사1","상인 훔치기 실패 대화 패턴"]
[605072,"상인 훔치기 실패 대사2"]
[605073,"상인 훔치기 실패 대사3"]
[605074,"상인 훔치기 실패 대사4"]
[605075,"상인 훔치기 실패 대사5"]
[605076,"상인 훔치기 실패 대사6"]
[605081,"상인 죽을 때 대사1","상인 죽음 대화 패턴"]
[605082,"상인 죽을 때 대사2"]
[605083,"상인 죽을 때 대사3"]
[605084,"상인 죽을 때 대사4"]
[605085,"상인 죽을 때 대사5"]
[605086,"상인 죽을 때 대사6"]
[{"$f":"A988+1000","v":606011},"상인 등장 대사1","등장 대화 패턴"]
[{"$f":"A989+1000","v":606012},"상인 등장 대사2"]
[{"$f":"A990+1000","v":606013},"상인 등장 대사3"]
[606014,"상인 등장 대사4"]
[606015,"상인 등장 대사5"]
[606016,"상인 등장 대사6"]
[606021,"상인 전투 대사1","전투 대화 패턴"]
[606022,"상인 전투 대사2"]
[606023,"상인 전투 대사3"]
[606024,"상인 전투 대사4"]
[606025,"상인 전투 대사5"]
[606026,"상인 전투 대사6"]
[606031,"상인 헤어짐 대사1","상인이 떠날 때 대화 패턴"]
[606032,"상인 헤어짐 대사2"]
[606033,"상인 헤어짐 대사3"]
[606034,"상인 헤어짐 대사4"]
[606035,"상인 헤어짐 대사5"]
[606036,"상인 헤어짐 대사6"]
[606041,"상인이 판매중인 상품을 보여줄 때 대사1","상인이 판매중인 상품을 보여줄 때"]
[606042,"상인이 판매중인 상품을 보여줄 때 대사2"]
[606043,"상인이 판매중인 상품을 보여줄 때 대사3"]
[606044,"상인이 판매중인 상품을 보여줄 때 대사4"]
[606045,"상인이 판매중인 상품을 보여줄 때 대사5"]
[606046,"상인이 판매중인 상품을 보여줄 때 대사6"]
[606051,"플레이어가 상품을 구매했을 때 대사1","플레이어가 상품을 구매했을 때"]
[606052,"플레이어가 상품을 구매했을 때 대사2"]
[606053,"플레이어가 상품을 구매했을 때 대사3"]
[606054,"플레이어가 상품을 구매했을 때 대사4"]
[606055,"플레이어가 상품을 구매했을 때 대사5"]
[606056,"플레이어가 상품을 구매했을 때 대사6"]
[606061,"상인 거래 거부 대화 패턴 대사1","상인 거래 거부 대화 패턴"]
[606062,"상인 거래 거부 대화 패턴 대사2"]
[606063,"상인 거래 거부 대화 패턴 대사3"]
[606064,"상인 거래 거부 대화 패턴 대사4"]
[606065,"상인 거래 거부 대화 패턴 대사5"]
[606066,"상인 거래 거부 대화 패턴 대사6"]
[606071,"상인 훔치기 실패 대사1","상인 훔치기 실패 대화 패턴"]
[606072,"상인 훔치기 실패 대사2"]
[606073,"상인 훔치기 실패 대사3"]
[606074,"상인 훔치기 실패 대사4"]
[606075,"상인 훔치기 실패 대사5"]
[606076,"상인 훔치기 실패 대사6"]
[606081,"상인 죽을 때 대사1","상인 죽음 대화 패턴"]
[606082,"상인 죽을 때 대사2"]
[606083,"상인 죽을 때 대사3"]
[606084,"상인 죽을 때 대사4"]
[606085,"상인 죽을 때 대사5"]
[606086,"상인 죽을 때 대사6"]
[{"$f":"A1036+1000","v":607011},"상인 등장 대사1","등장 대화 패턴"]
[{"$f":"A1037+1000","v":607012},"상인 등장 대사2"]
[{"$f":"A1038+1000","v":607013},"상인 등장 대사3"]
[607014,"상인 등장 대사4"]
[607015,"상인 등장 대사5"]
[607016,"상인 등장 대사6"]
[607021,"상인 전투 대사1","전투 대화 패턴"]
[607022,"상인 전투 대사2"]
[607023,"상인 전투 대사3"]
[607024,"상인 전투 대사4"]
[607025,"상인 전투 대사5"]
[607026,"상인 전투 대사6"]
[607031,"상인 헤어짐 대사1","상인이 떠날 때 대화 패턴"]
[607032,"상인 헤어짐 대사2"]
[607033,"상인 헤어짐 대사3"]
[607034,"상인 헤어짐 대사4"]
[607035,"상인 헤어짐 대사5"]
[607036,"상인 헤어짐 대사6"]
[607041,"상인이 판매중인 상품을 보여줄 때 대사1","상인이 판매중인 상품을 보여줄 때"]
[607042,"상인이 판매중인 상품을 보여줄 때 대사2"]
[607043,"상인이 판매중인 상품을 보여줄 때 대사3"]
[607044,"상인이 판매중인 상품을 보여줄 때 대사4"]
[607045,"상인이 판매중인 상품을 보여줄 때 대사5"]
[607046,"상인이 판매중인 상품을 보여줄 때 대사6"]
[607051,"플레이어가 상품을 구매했을 때 대사1","플레이어가 상품을 구매했을 때"]
[607052,"플레이어가 상품을 구매했을 때 대사2"]
[607053,"플레이어가 상품을 구매했을 때 대사3"]
[607054,"플레이어가 상품을 구매했을 때 대사4"]
[607055,"플레이어가 상품을 구매했을 때 대사5"]
[607056,"플레이어가 상품을 구매했을 때 대사6"]
[607061,"상인 거래 거부 대화 패턴 대사1","상인 거래 거부 대화 패턴"]
[607062,"상인 거래 거부 대화 패턴 대사2"]
[607063,"상인 거래 거부 대화 패턴 대사3"]
[607064,"상인 거래 거부 대화 패턴 대사4"]
[607065,"상인 거래 거부 대화 패턴 대사5"]
[607066,"상인 거래 거부 대화 패턴 대사6"]
[607071,"상인 훔치기 실패 대사1","상인 훔치기 실패 대화 패턴"]
[607072,"상인 훔치기 실패 대사2"]
[607073,"상인 훔치기 실패 대사3"]
[607074,"상인 훔치기 실패 대사4"]
[607075,"상인 훔치기 실패 대사5"]
[607076,"상인 훔치기 실패 대사6"]
[607081,"상인 죽을 때 대사1","상인 죽음 대화 패턴"]
[607082,"상인 죽을 때 대사2"]
[607083,"상인 죽을 때 대사3"]
[607084,"상인 죽을 때 대사4"]
[607085,"상인 죽을 때 대사5"]
[607086,"상인 죽을 때 대사6"]
[{"$f":"A1084+1000","v":608011},"상인 등장 대사1","등장 대화 패턴"]
[{"$f":"A1085+1000","v":608012},"상인 등장 대사2"]
[{"$f":"A1086+1000","v":608013},"상인 등장 대사3"]
[608014,"상인 등장 대사4"]
[608015,"상인 등장 대사5"]
[608016,"상인 등장 대사6"]
[608021,"상인 전투 대사1","전투 대화 패턴"]
[608022,"상인 전투 대사2"]
[608023,"상인 전투 대사3"]
[608024,"상인 전투 대사4"]
[608025,"상인 전투 대사5"]
[608026,"상인 전투 대사6"]
[608031,"상인 헤어짐 대사1","상인이 떠날 때 대화 패턴"]
[608032,"상인 헤어짐 대사2"]
[608033,"상인 헤어짐 대사3"]
[608034,"상인 헤어짐 대사4"]
[608035,"상인 헤어짐 대사5"]
[608036,"상인 헤어짐 대사6"]
[608041,"상인이 판매중인 상품을 보여줄 때 대사1","상인이 판매중인 상품을 보여줄 때"]
[608042,"상인이 판매중인 상품을 보여줄 때 대사2"]
[608043,"상인이 판매중인 상품을 보여줄 때 대사3"]
[608044,"상인이 판매중인 상품을 보여줄 때 대사4"]
[608045,"상인이 판매중인 상품을 보여줄 때 대사5"]
[608046,"상인이 판매중인 상품을 보여줄 때 대사6"]
[608051,"플레이어가 상품을 구매했을 때 대사1","플레이어가 상품을 구매했을 때"]
[608052,"플레이어가 상품을 구매했을 때 대사2"]
[608053,"플레이어가 상품을 구매했을 때 대사3"]
[608054,"플레이어가 상품을 구매했을 때 대사4"]
[608055,"플레이어가 상품을 구매했을 때 대사5"]
[608056,"플레이어가 상품을 구매했을 때 대사6"]
[608061,"상인 거래 거부 대화 패턴 대사1","상인 거래 거부 대화 패턴"]
[608062,"상인 거래 거부 대화 패턴 대사2"]
[608063,"상인 거래 거부 대화 패턴 대사3"]
[608064,"상인 거래 거부 대화 패턴 대사4"]
[608065,"상인 거래 거부 대화 패턴 대사5"]
[608066,"상인 거래 거부 대화 패턴 대사6"]
[608071,"상인 훔치기 실패 대사1","상인 훔치기 실패 대화 패턴"]
[608072,"상인 훔치기 실패 대사2"]
[608073,"상인 훔치기 실패 대사3"]
[608074,"상인 훔치기 실패 대사4"]
[608075,"상인 훔치기 실패 대사5"]
[608076,"상인 훔치기 실패 대사6"]
[608081,"상인 죽을 때 대사1","상인 죽음 대화 패턴"]
[608082,"상인 죽을 때 대사2"]
[608083,"상인 죽을 때 대사3"]
[608084,"상인 죽을 때 대사4"]
[608085,"상인 죽을 때 대사5"]
[608086,"상인 죽을 때 대사6"]
[{"$f":"A1132+1000","v":609011},"상인 등장 대사1","등장 대화 패턴"]
[{"$f":"A1133+1000","v":609012},"상인 등장 대사2"]
[{"$f":"A1134+1000","v":609013},"상인 등장 대사3"]
[609014,"상인 등장 대사4"]
[609015,"상인 등장 대사5"]
[609016,"상인 등장 대사6"]
[609021,"상인 전투 대사1","전투 대화 패턴"]
[609022,"상인 전투 대사2"]
[609023,"상인 전투 대사3"]
[609024,"상인 전투 대사4"]
[609025,"상인 전투 대사5"]
[609026,"상인 전투 대사6"]
[609031,"상인 헤어짐 대사1","상인이 떠날 때 대화 패턴"]
[609032,"상인 헤어짐 대사2"]
[609033,"상인 헤어짐 대사3"]
[609034,"상인 헤어짐 대사4"]
[609035,"상인 헤어짐 대사5"]
[609036,"상인 헤어짐 대사6"]
[609041,"상인이 판매중인 상품을 보여줄 때 대사1","상인이 판매중인 상품을 보여줄 때"]
[609042,"상인이 판매중인 상품을 보여줄 때 대사2"]
[609043,"상인이 판매중인 상품을 보여줄 때 대사3"]
[609044,"상인이 판매중인 상품을 보여줄 때 대사4"]
[609045,"상인이 판매중인 상품을 보여줄 때 대사5"]
[609046,"상인이 판매중인 상품을 보여줄 때 대사6"]
[609051,"플레이어가 상품을 구매했을 때 대사1","플레이어가 상품을 구매했을 때"]
[609052,"플레이어가 상품을 구매했을 때 대사2"]
[609053,"플레이어가 상품을 구매했을 때 대사3"]
[609054,"플레이어가 상품을 구매했을 때 대사4"]
[609055,"플레이어가 상품을 구매했을 때 대사5"]
[609056,"플레이어가 상품을 구매했을 때 대사6"]
[609061,"상인 거래 거부 대화 패턴 대사1","상인 거래 거부 대화 패턴"]
[609062,"상인 거래 거부 대화 패턴 대사2"]
[609063,"상인 거래 거부 대화 패턴 대사3"]
[609064,"상인 거래 거부 대화 패턴 대사4"]
[609065,"상인 거래 거부 대화 패턴 대사5"]
[609066,"상인 거래 거부 대화 패턴 대사6"]
[609071,"상인 훔치기 실패 대사1","상인 훔치기 실패 대화 패턴"]
[609072,"상인 훔치기 실패 대사2"]
[609073,"상인 훔치기 실패 대사3"]
[609074,"상인 훔치기 실패 대사4"]
[609075,"상인 훔치기 실패 대사5"]
[609076,"상인 훔치기 실패 대사6"]
[609081,"상인 죽을 때 대사1","상인 죽음 대화 패턴"]
[609082,"상인 죽을 때 대사2"]
[609083,"상인 죽을 때 대사3"]
[609084,"상인 죽을 때 대사4"]
[609085,"상인 죽을 때 대사5"]
[609086,"상인 죽을 때 대사6"]
[810011,"PC1 각성1 이름"]
[810111,"PC1 각성1 최소 공격력이 {0} 증가한다."]
[810021,"PC1 각성2-1 이름"]
[810121,"PC1 각성2-1 최대 공격력이 {0} 증가한다."]
[810022,"PC1 각성2-2 이름"]
[810122,"PC1 각성2-2 최대 생명력이 {0} 증가한다."]
[820011,"PC2 각성1 이름"]
[820111,"최대 포션 소지 개수가 {0} 증가한다."]
[820021,"PC2 각성2-1 이름"]
[820121,"근접 회피율이 {0} 증가한다."]
[820022,"PC2 각성2-2 이름"]
[820122,"원거리 회피율이 {0} 증가한다."]
[900101,"매직 미사일 피해 +{0}"]
[900102,"암흑 미사일 피해 +{0}%"]
[900201,"시체 폭파 피해 +{0}"]
[900202,"흡혈 피해 +{0}%"]
[900301,"전기 충격 피해 +{0}"]
[900302,"낙뢰 피해 +{0}%"]
[900401,"운석 피해 +{0}%"]
[900402,"화염구 피해 +{0}%"]
[900501,"신성 피해 +{0}"]
[900502,"최대 보호막 증가 +{0}%"]
[900601,"칼날 바위 피해 +{0}%"]
[900602,"화살의 비 피해 +{0}%"]
[900701,"파멸의 광선 피해 +{0}%"]
[900702,"관통 번개 피해 +{0}%"]
[900801,"혹한의 눈보라 피해 +{0}%"]
[900802,"신비한 폭발 피해 +{0}%"]
[900901,"회복 효과 +{0}"]
[900902,"최대 생명력 증가 +{0}%"]
[901001,"공속 증가 +{0}%"]
[901002,"환영의 창 피해 +{0}%"]
[901101,"치명타 확률 증가 +{0}%"]
[901102,"치명타 데미지 증가 +{0}%"]
[901201,"골드 증가 +{0}%"]
[901202,"경험치 증가 +{0}%"]
[1000001,"영웅"]
[1000002,"카드"]
[1000003,"장비"]
[1000004,"미션"]
[1000005,"상점"]
[1000101,"정보"]
[1000102,"인장"]
[1000103,"진화"]
[1000104,"각성"]
[1000105,"특성"]
[1000111,"해제"]
[1000112,"강화"]
[1000113,"선행 각성이 필요합니다."]
[1000114,"강화가 불가능한 각성입니다."]
[1000115,"도전"]
[1000116,"모든 스킬 카드덱 획득"]
[1000117,"모든 스킬 카드덱 {0}성 달성"]
[1000118,"{0}의 시련"]
[1000119,"{0}의 시련 {1} 클리어"]
[1000120,"한계돌파"]
[1000121,"착용 인장 보너스"]
[1000122,"인장뽑기"]
[1000123,"보유인장 ({0})"]
[1000124,"장착"]
[1000125,"합성"]
[1000126,"장착중인 인장입니다. 기존 캐릭터에서 인장을 해제 후, 장착하시겠습니까?"]
[1000127,"{0}\n장착중"]
[1000128,"모두"]
[1000129,"성급 낮은 순"]
[1000130,"성급 높은 순"]
[1000131,"장착 불가"]
[1000132,"장착 가능"]
[1000133,"캐릭터 {0}성 달성 시 개방됩니다."]
[1010001,"기본 공격"]
[1010002,"패시브"]
[1010003,"고유 특성"]
[1020001,"자신"]
[1020002,"적"]
[1020003,"전열의 적"]
[1020004,"후열의 적"]
[1020005,"근거리 적"]
[1020006,"원거리 적"]

{"sheet":"MonsterList","index":18,"n_rows":185,"n_cols":33,"rows_kept":185,"cut":false,"hidden":false,"merged":[]}
["n_ID","n_Name","e_MonsterType","s_Image","n_RewardExp","n_HP","n_Shield","f_AttackCoolTime","n_AttackMin","n_AttackMax","n_HitRate","f_Cri","f_CriDmg","n_Avoid_Meele","n_Avoid_Range","f_Scale","e_AttackType","s_Projectile","n_Specificity1","n_Specificity2","n_Specificity3","n_Specificity4",null,null,null,null,null,null,null,null,null,"플레이어 명중력"]
["_몬스터 ID","몬스터 이름","몬스터 종류","몬스터 이미지","처치 시 획득 경험치","체력","보호막","공격 쿨타임","최소 공격력","최대 공격력","명중력 (정수)","치명타 확률","치명타 피해량","회피력(근) (정수)","회피력(원) (정수)","몬스터 크기 배율","기본 공격 타입","기본 공격 투사체 경로","몬스터 특성1","몬스터 특성2","몬스터 특성3","몬스터 특성4","원본 참고용","몬스터 분류","Lv",null,"DPS","몬스터 특성",null,null,null,100]
[10001,{"$f":"A3+100000","v":110001},"Boss_Range",{"$f":"A3","v":10001},{"$f":"ROUNDDOWN(F3/2,0)","v":10},20,15,2.2999999999999998,4,6,100,25,150,34,34,1.3,{"$f":"IF(Z3=\"원거리\",\"Range\",\"Melee\")","v":"Range"},"Projectiles_light",31001,0,0,0,"놀아처1","보스 몬스터",1,"원거리",{"$f":"ROUND(((I3 + J3) / 2) * (1 + (L3 / 100) * ((M3 / 100) - 1)) / H3 * (K3 / 100),2)","v":2.4500000000000002},"크리티컬 10%",null,null,{"$f":"INT(SQRT((F3*Y3)*3)+1)","v":8},{"$f":"$AF$2/(N3*3.69)","v":0.79706679419735382},1.2]
[10002,110002,"Boss_Melee",10002,15,30,22,1.9,6,8,100,12.5,150,34,34,1.3,"Melee","MeleeAttack_Sword",31002,0,0,0,"놀강도2","보스 몬스터",2,"근접",3.91,"광포화- 신속화 50%",null,null,{"$f":"INT(SQRT((F4*Y4)*3)+1)","v":14},{"$f":"$AF$2/(N4*3.69)","v":0.79706679419735382},1.2]
[10003,110003,"Boss_Melee",10003,21,42,16,1.6,6,9,100,18,150,34,34,1.3,"Melee","MeleeAttack_Sword",31003,0,0,0,"임프전사1","보스 몬스터",3,"근접",5.1100000000000003,"광포화- 공격력 50%",null,null,20,0.79706679419735382,1.3]
[10004,110004,"Boss_Melee",10004,56,112,0,2.6,7,30,100,15,200,31,31,1.3,"Melee","MeleeAttack_Blunt",31004,32004,0,0,"오우거1","보스 몬스터",4,"근접",8.18,"체력 2배, 최대 공격력 2배",null,null,37,0.87420229041000086,1.6]
[10005,110005,"Boss_Range",10005,26,53,66,1.6,7,11,100,10,150,35,35,1.3,"Range","vfx_ToonProjectile_Bomb03Orange",31005,0,0,0,"바포메트6","보스 몬스터",5,"원거리",5.91,"둔화 30%",null,null,29,0.77429345722028642,1.5]
[10006,110006,"Boss_Range",10006,29,58,72,1.4,7,10,100,10,150,35,35,1.3,"Range","vfx_Projectile_Fireball03_Green",31006,0,0,0,"거미여왕2","보스 몬스터",6,"원거리",6.38,"중독 5초",null,null,33,0.77429345722028642,1.6]
[10007,110007,"Boss_Melee",10007,33,66,52,1.6,8,15,100,10,150,35,35,1.3,"Melee","MeleeAttack_Sword",31007,0,0,0,"흑기사2","보스 몬스터",7,"근접",7.55,"실드 회복",null,null,38,0.77429345722028642,1.4]
[10008,110008,"Boss_Melee",10008,42,85,0,1.2,7,9,100,25,180,38,38,1.3,"Melee","MeleeAttack_Claw",31008,0,0,0,"늑대인간","보스 몬스터",8,"근접",8,"고정 피해 흡혈",null,null,46,0.71316502638710599,1.3]
[10009,110009,"Boss_Melee",10009,44,88,60,2.15,12,20,100,15,180,30,30,1.3,"Melee","MeleeAttack_Blunt",31009,0,0,0,"대사탄1","보스 몬스터",9,"근접",8.33,"무적 5초",null,null,49,0.90334236675700086,1.8]
[10010,110010,"Boss_Range",10010,17,35,282,2.8,18,20,100,30,200,36,36,1.3,"Range","Projectiles_light",31010,32010,0,0,"다크엘프 아처1","보스 몬스터",10,"원거리",8.82,"광포화 - 신속","치명타 15%",null,33,0.75278530563083401,1.4]
[10011,110011,"Boss_Melee",10011,51,102,72,2.0499999999999998,13,21,100,15,180,30,30,1.3,"Melee","MeleeAttack_Sword",31011,32011,0,0,"대사탄2","보스 몬스터",11,"근접",9.2899999999999991,"피해 무효","강화 -공격력",null,59,0.90334236675700086,1.8]
[10012,110012,"Boss_Melee",10012,48,97,77,1.5,13,14,100,33,150,37,37,1.3,"Melee","MeleeAttack_Sword",31012,32012,0,0,"데스나이트3","보스 몬스터",12,"근접",10.49,"광포화 신속화 60%","치명타 15%",null,60,0.73243975683000073,1.6]
[10013,110013,"Boss_Melee",10013,42,84,223,1.5,14,16,100,10,150,37,37,1.3,"Melee","FX_Double Claw",31013,32013,0,0,"메두사1","보스 몬스터",13,"근접",10.5,"둔화 50%","실드 25%",null,58,0.73243975683000073,1.5]
[10014,110014,"Boss_Range",10014,53,106,108,1.625,16,28,100,10,150,37,37,1.3,"Range","Projectile 20 black",31014,32014,0,0,"바포메트2","보스 몬스터",14,"원거리",14.22,"화상","공격력 25%",null,67,0.73243975683000073,1.5]
[10015,110015,"Boss_Melee",10015,69,138,0,3,19,45,100,33,200,33,33,1.3,"Melee","MeleeAttack_Blunt",31015,32015,0,0,"트롤 워리어4","보스 몬스터",15,"근접",14.19,"기절","치명타 15%",null,79,0.82122033341545542,1.7]
[10016,110016,"Boss_Melee",10016,60,121,100,2.35,26,34,100,10,150,37,37,1.3,"Melee","MeleeAttack_Sword",31016,32016,0,0,"흑기사3","보스 몬스터",16,"근접",13.4,"광포화 공격력","광포화 신속",null,77,0.73243975683000073,1.5]
[10017,110017,"Boss_Range",10017,45,91,315,1.6,20,23,100,12,150,38,38,1.3,"Range","Projectiles_heart",31017,32017,0,0,"흡혈귀여왕2","보스 몬스터",17,"원거리",14.24,"고정 피해 흡혈","실드 회복",null,69,0.71316502638710599,1.6]
[10018,110018,"Boss_Melee",10018,79,158,0,2.8,30,45,100,15,200,33,33,1.3,"Melee","MeleeAttack_Blunt",31018,32018,0,0,"에티4","보스 몬스터",18,"근접",15.4,"강화  공격력","부활",null,93,0.82122033341545542,1.8]
[10019,110019,"Boss_Melee",10019,71,142,111,2.4,20,48,100,15,200,32,32,1.3,"Melee","MeleeAttack_Claw",31019,32019,0,0,"레드드래곤3","보스 몬스터",19,"근접",16.29,"화상","회복",null,90,0.84688346883468835,3.2]
[10020,110020,"Boss_Range",10020,59,118,230,1.625,25,28,100,10,150,38,38,1.3,"Range","Projectiles_water",31020,32020,0,0,"메두사2","보스 몬스터",20,"원거리",17.12,"실드 회복","중독 5초",null,85,0.71316502638710599,1.6]
[10021,110021,"Boss_Melee",10021,74,149,120,2.2999999999999998,36,45,100,10,150,38,38,1.3,"Melee","MeleeAttack_Sword",31021,32021,0,0,"흑기사1","보스 몬스터",21,"근접",18.489999999999998,"피해 무효","신속화",null,97,0.71316502638710599,1.8]
[10022,110022,"Boss_Melee",10022,31,63,525,2.8,33,62,100,15,200,30,30,1.3,"Melee","MeleeAttack_Blunt",31022,32022,0,0,"용암골렘2","보스 몬스터",22,"근접",19.510000000000002,"광포화 공격력","화상",null,65,0.90334236675700086,2]
[10023,110023,"Boss_Melee",10023,85,170,128,3,26,82,100,15,200,34,34,1.3,"Melee","MeleeAttack_Claw",31023,32023,0,0,"레드드래곤1","보스 몬스터",23,"근접",20.7,"화상","회복",null,109,0.79706679419735382,2.8]
[10024,110024,"Boss_Range",10024,82,165,132,1.67,32,36,100,10,150,39,39,1.3,"Range","Projectile 20 black",31024,32024,0,0,"바포메트7","보스 몬스터",24,"원거리",21.38,"실드 회복","둔화",null,109,0.69487874365923152,1.7]
[10025,110025,"Boss_Range",10025,85,170,136,1.5,30,34,100,15,150,39,39,1.3,"Range","vfx_Projectile_Fireball03_Green",31025,32025,0,0,"거미여왕1","보스 몬스터",25,"원거리",22.93,"중독 5초","둔화 30%",null,113,0.69487874365923152,1.6]
[10026,110026,"Boss_Melee",10026,88,176,142,1.43,26,38,100,15,150,39,39,1.3,"Melee","MeleeAttack_Sword",31026,32026,0,0,"데스나이트1","보스 몬스터",26,"근접",24.06,"광포화 신속화 60%","부활",null,118,0.69487874365923152,1.7]
[10027,110027,"Boss_Range",10027,91,182,146,2.6,22,98,100,15,200,39,39,1.3,"Range","FX_Shoot_06_projectile",31027,32027,0,0,"레드드래곤4","보스 몬스터",27,"원거리",26.54,"피해 무효","회복","화상",122,0.69487874365923152,3]
[10028,110028,"Boss_Melee",10028,92,184,182,1.75,43,46,100,15,180,40,40,1.3,"Melee","MeleeAttack_Scythe",31028,32028,0,0,"타락한 천사","보스 몬스터",28,"근접",28.48,"부활","무적","광포화 - 공격",125,0.6775067750677507,2.2000000000000002]
[11001,{"$f":"A31+100000","v":111001},{"$f":"\"Normal_\"&Q31","v":"Normal_Melee"},{"$f":"A31","v":11001},1,2,0,1.6,1,2,100,{"$f":"IF(Z31=\"근접\",5,3)","v":5},{"$f":"IF(Z31=\"근접\",130,120)","v":130},30,30,1.3,{"$f":"IF(Z31=\"원거리\",\"Range\",\"Melee\")","v":"Melee"},"MeleeAttack_Dagger",0,0,0,0,"놀1","수인형 몬스터",1,"근접",0.95,"공속 빠름",null,null,{"$f":"INT(F31/6)","v":0},0.90334236675700086,1]
[11002,111002,{"$f":"\"Normal_\"&Q32","v":"Normal_Melee"},11002,1,2,0,1.85,1,3,100,{"$f":"IF(Z32=\"근접\",5,3)","v":5},{"$f":"IF(Z32=\"근접\",130,120)","v":130},30,30,1.3,"Melee","MeleeAttack_Sword",0,0,0,0,"놀2","수인형 몬스터",1,"근접",1.1000000000000001,"공속 빠름",null,null,{"$f":"H32/3","v":0.6166666666666667},0.90334236675700086,1]
[11003,111003,"Normal_Melee",11003,1,3,0,1.4500000000000002,2,4,100,5,130,30,30,1.3,"Melee","MeleeAttack_Sword",0,0,0,0,"놀3","수인형 몬스터",2,"근접",2.1,"공속 빠름",null,null,0.48333333333333339,0.90334236675700086,1]
[11004,111004,"Normal_Melee",11004,5,10,0,1.1000000000000001,3,5,100,5,130,30,30,1.3,"Melee","MeleeAttack_DoubleSword",0,0,0,0,"놀강도1","수인형 몬스터",6,"근접",3.69,"공속 빠름",null,null,0.3666666666666667,0.90334236675700086,1]
[11005,111005,"Normal_Melee",11005,1,3,0,1.2000000000000002,2,4,100,5,130,30,30,1.3,"Melee","MeleeAttack_DoubleSword",0,0,0,0,"놀강도3","수인형 몬스터",2,"근접",{"$f":"ROUND(((I35 + J35) / 2) * (1 + (L35 / 100) * ((M35 / 100) - 1)) / H35 * (K35 / 100),2)","v":2.54},"공속 빠름",null,null,0.40000000000000008,0.90334236675700086,1]
[11006,111006,"Normal_Melee",11006,3,6,0,2.1,3,7,100,5,130,30,30,1.3,"Melee","MeleeAttack_DoubleSword",0,0,0,0,"놀강도4","수인형 몬스터",5,"근접",2.42,"공속 빠름",null,null,0.70000000000000007,0.90334236675700086,1]
[11007,111007,"Normal_Range",11007,1,1,0,2.7,2,4,100,8,120,30,30,1.3,"Range","Projectiles_light",41007,0,0,0,"놀아처2","수인형 몬스터",1,"원거리",1.1299999999999999,"치명타 확률+5%",null,null,0.9,0.90334236675700086,1]
[11008,111008,"Normal_Range",11008,1,2,0,2.8,4,6,100,8,120,30,30,1.3,"Range","Projectiles_light",41008,0,0,0,"놀아처3","수인형 몬스터",3,"원거리",1.81,"치명타 확률+5%",null,null,0.93333333333333324,0.90334236675700086,1]
[11009,111009,"Normal_Melee",11009,3,7,1,2.9,4,9,100,5,130,30,30,1.3,"Melee","MeleeAttack_Axe",0,0,0,0,"미노타우르스 광전사1","수인형 몬스터",4,"근접",2.2799999999999998,"체력 10%",null,null,0.96666666666666667,0.90334236675700086,1.4]
[11010,111010,"Normal_Melee",11010,8,18,4,2.6,10,12,100,5,130,30,30,1.3,"Melee","MeleeAttack_Axe",0,0,0,0,"미노타우르스 광전사2","수인형 몬스터",10,"근접",4.29,"체력 10%",null,null,null,0.90334236675700086,1.4]
[11011,111011,"Normal_Melee",11011,8,18,4,2.25,8,11,100,5,130,30,30,1.3,"Melee","MeleeAttack_Axe",0,0,0,0,"미노타우르스 광전사3","수인형 몬스터",10,"근접",4.29,"체력 10%",null,null,null,0.90334236675700086,1.4]
[11012,111012,"Normal_Melee",11012,6,14,3,2.4,5,9,100,5,130,30,30,1.3,"Melee","MeleeAttack_Axe",0,0,0,0,"미노타우르스 광전사4","수인형 몬스터",8,"근접",2.96,"체력 10%",null,null,null,0.90334236675700086,1.4]
[11013,111013,"Normal_Melee",11013,2,6,1,2.6,3,7,100,5,130,30,30,1.3,"Melee","MeleeAttack_Axe",0,0,0,0,"미노타우로스 도살자1","수인형 몬스터",3,"근접",1.95,"체력 10%",null,null,null,0.90334236675700086,1.4]
[11014,111014,"Normal_Melee",11014,6,14,3,3,6,11,100,5,130,30,30,1.3,"Melee","MeleeAttack_Axe",0,0,0,0,"미노타우로스 도살자2","수인형 몬스터",8,"근접",2.88,"체력 10%",null,null,null,0.90334236675700086,1.5]
[11015,111015,"Normal_Melee",11015,18,37,9,2.8,22,42,100,5,130,30,30,1.3,"Melee","MeleeAttack_Axe",41015,0,0,0,"미노타우르스 챔피언1","수인형 몬스터",23,"근접",11.6,"피해 무효",null,null,null,0.90334236675700086,1.4]
[11016,111016,"Normal_Melee",11016,18,37,9,2.2999999999999998,17,36,100,5,130,30,30,1.3,"Melee","MeleeAttack_Axe",41016,0,0,0,"미노타우르스 챔피언2","수인형 몬스터",23,"근접",11.69,"피해 무효",null,null,null,0.90334236675700086,1.5]
[11017,111017,"Normal_Melee",11017,9,18,4,2.65,12,18,100,5,130,30,30,1.3,"Melee","MeleeAttack_Axe",0,0,0,0,"미노타우르스 챔피언3","수인형 몬스터",11,"근접",5.75,"공격력 15%",null,null,null,0.90334236675700086,1.5]
[11018,111018,"Normal_Melee",11018,6,13,3,2.9,9,11,100,5,130,30,30,1.3,"Melee","MeleeAttack_Axe",0,0,0,0,"미노타우르스 챔피언4","수인형 몬스터",8,"근접",3.5,"공격력 15%",null,null,null,0.90334236675700086,1.5]
[11019,111019,"Normal_Melee",11019,6,13,42,2.85,8,12,100,5,130,30,30,1.3,"Melee","MeleeAttack_Axe",0,0,0,0,"미노타우르스 챔피언5","수인형 몬스터",8,"근접",3.56,"공격력 15%",null,null,null,0.90334236675700086,1.5]
[11020,111020,"Normal_Melee",11020,19,38,0,3.35,40,53,100,5,130,30,30,1.3,"Melee","MeleeAttack_Blunt",0,0,0,0,"버그베어1","수인형 몬스터",24,"근접",14.09,"공격력 15%",null,null,null,0.90334236675700086,1.4]
[11021,111021,"Normal_Melee",11021,7,14,0,3.3,11,13,100,5,130,30,30,1.3,"Melee","MeleeAttack_Blunt",0,0,0,0,"버그베어2","수인형 몬스터",9,"근접",3.69,"공격력 15%",null,null,null,0.90334236675700086,1.5]
[11022,111022,"Normal_Melee",11022,7,14,0,3.3,11,14,100,5,130,30,30,1.3,"Melee","MeleeAttack_Blunt",0,0,0,0,"버그베어3","수인형 몬스터",9,"근접",3.84,"공격력 15%",null,null,null,0.90334236675700086,1.4]
[11023,{"$f":"A53+100000","v":111023},"Normal_Melee",{"$f":"A53","v":11023},7,14,0,3.1,9,15,100,{"$f":"IF(Z53=\"근접\",5,3)","v":5},{"$f":"IF(Z53=\"근접\",130,120)","v":130},30,30,1.3,{"$f":"IF(Z53=\"원거리\",\"Range\",\"Melee\")","v":"Melee"},"MeleeAttack_Blunt",0,0,0,0,"버그베어4","수인형 몬스터",9,"근접",3.93,"공격력 15%",null,null,null,0.90334236675700086,1.4]
[11024,111024,"Normal_Range",11024,3,6,0,2.8,4,12,100,3,150,30,30,1.3,"Range","vfx_ToonProjectile_Bomb03Orange",41024,0,0,0,"싸이클롭스1","수인형 몬스터",7,"원거리",2.9,"치명타 피해량 + 30%",null,null,null,0.90334236675700086,1.4]
[11025,111025,"Normal_Range",11025,1,3,0,2.7,4,8,100,3,150,30,30,1.3,"Range","vfx_ToonProjectile_Bomb03Red",41025,0,0,0,"싸이클롭스2","수인형 몬스터",4,"원거리",2.2599999999999998,"치명타 피해량 + 30%",null,null,null,0.90334236675700086,1.4]
[11026,111026,"Normal_Range",11026,6,13,0,2.9,9,35,100,3,150,30,30,1.3,"Range","vfx_ToonProjectile_Bomb03Blue",41026,0,0,0,"싸이클롭스3","수인형 몬스터",16,"원거리",7.7,"치명타 피해량 + 30%",null,null,null,0.90334236675700086,1.4]
[11027,111027,"Normal_Melee",11027,13,32,0,2.5,10,30,100,5,130,30,30,1.3,"Melee","MeleeAttack_Blow",0,0,0,0,"예티1","수인형 몬스터",17,"근접",8.1199999999999992,"생명력 20%",null,null,null,0.90334236675700086,1.3]
[11028,111028,"Normal_Melee",11028,13,32,0,2.65,14,28,100,5,130,30,30,1.3,"Melee","MeleeAttack_Blow",0,0,0,0,"예티2","수인형 몬스터",17,"근접",8.0399999999999991,"생명력 20%",null,null,null,0.90334236675700086,1.4]
[11029,111029,"Normal_Melee",11029,4,8,0,2.8,3,10,100,5,130,30,30,1.3,"Melee","MeleeAttack_Blunt",41029,0,0,0,"트롤1","수인형 몬스터",5,"근접",2.36,"회복",null,null,null,0.90334236675700086,1.5]
[11030,111030,"Normal_Melee",11030,2,5,0,2.75,2,9,100,5,130,30,30,1.3,"Melee","MeleeAttack_Blunt",41030,0,0,0,"트롤2","수인형 몬스터",3,"근접",2.0299999999999998,"회복",null,null,null,0.90334236675700086,1.4]
[11031,111031,"Normal_Melee",11031,2,5,0,2.9,2,9,100,5,130,30,30,1.3,"Melee","MeleeAttack_Blunt",41031,0,0,0,"트롤3","수인형 몬스터",3,"근접",1.93,"회복",null,null,null,0.90334236675700086,1.4]
[12001,112001,"Normal_Melee",12001,17,34,0,1.2999999999999998,17,18,100,10,130,30,30,1.3,"Melee","MeleeAttack_Sword",51001,52001,0,0,"강도1","인간형 몬스터",22,"근접",13.87,"공격속도 빠름","치명타 5%",null,null,0.90334236675700086,1.2]
[12002,112002,"Normal_Melee",12002,17,34,0,1.4500000000000002,16,22,100,10,130,30,30,1.3,"Melee","MeleeAttack_Sword",51002,52002,0,0,"강도2","인간형 몬스터",22,"근접",13.5,"공격속도 빠름","치명타 5%",null,null,0.90334236675700086,1.3]
[12003,112003,"Normal_Melee",12003,17,35,0,1.4,17,20,100,10,130,30,30,1.3,"Melee","MeleeAttack_Sword",51003,52003,0,0,"강도3","인간형 몬스터",22,"근접",13.61,"공격속도 빠름","치명타 5%",null,null,0.90334236675700086,1.3]
[12004,112004,"Normal_Melee",12004,9,19,0,1.7,8,10,100,5,130,30,30,1.3,"Melee","MeleeAttack_Dagger",51004,0,0,0,"고블린1","인간형 몬스터",12,"근접",5.37,"사망 - 공격력",null,null,null,0.90334236675700086,1.1000000000000001]
[12005,112005,"Normal_Melee",12005,9,19,0,2,7,14,100,5,130,30,30,1.3,"Melee","MeleeAttack_Scythe",51005,0,0,0,"고블린 라이더1","인간형 몬스터",12,"근접",5.33,"사망 - 공격력",null,null,null,0.90334236675700086,1.4]
[12006,112006,"Normal_Melee",12006,9,19,0,2.1,7,15,100,5,130,30,30,1.3,"Melee","MeleeAttack_Scythe",51006,0,0,0,"고블린 라이더2","인간형 몬스터",12,"근접",{"$f":"ROUND(((I67 + J67) / 2) * (1 + (L67 / 100) * ((M67 / 100) - 1)) / H67 * (K67 / 100),2)","v":5.32},"사망 - 공격력",null,null,null,0.90334236675700086,1.5]
[12007,{"$f":"A68+100000","v":112007},"Normal_Range",{"$f":"A68","v":12007},5,10,0,2.4,11,13,100,3,120,30,30,1.3,{"$f":"IF(Z68=\"원거리\",\"Range\",\"Melee\")","v":"Range"},"vfx_ToonProjectile_Bullet01Green",51007,0,0,0,"고블린 아처1","인간형 몬스터",12,"원거리",5.03,"사망 - 공격력",null,null,null,{"$f":"$AF$2/(N68*3.69)","v":0.90334236675700086},1.1000000000000001]
[12008,112008,"Normal_Melee",12008,12,24,0,3.1,13,28,100,5,150,30,30,1.3,"Melee","MeleeAttack_Axe",51008,52008,0,0,"광전사1","인간형 몬스터",15,"근접",6.78,"광포화 - 공격력","치명타 피해량20%",null,null,0.90334236675700086,1.4]
[12009,112009,"Normal_Melee",12009,19,38,0,3.3,24,60,100,5,150,30,30,1.3,"Melee","MeleeAttack_Axe",51009,52009,0,0,"광전사2","인간형 몬스터",24,"근접",13.05,"광포화 - 공격력","치명타 피해량20%",null,null,0.90334236675700086,1.5]
[12010,112010,"Normal_Melee",12010,12,24,0,3.35,22,23,100,5,150,30,30,1.3,"Melee","MeleeAttack_Axe",51010,52010,0,0,"광전사3","인간형 몬스터",15,"근접",6.88,"광포화 - 공격력","치명타 피해량20%",null,null,0.90334236675700086,1.6]
[12011,112011,"Normal_Melee",12011,19,38,0,3.2,35,46,100,5,150,30,30,1.3,"Melee","MeleeAttack_Axe",51011,52011,0,0,"광전사4","인간형 몬스터",24,"근접",12.97,"광포화 - 공격력","치명타 피해량20%",null,null,0.90334236675700086,1.5]
[12012,112012,"Normal_Melee",12012,12,24,0,3.3,18,26,100,5,150,30,30,1.3,"Melee","MeleeAttack_Axe",51012,52012,0,0,"광전사5","인간형 몬스터",15,"근접",6.83,"광포화 - 공격력","치명타 피해량20%",null,null,0.90334236675700086,1.7]
[12013,112013,"Normal_Melee",12013,9,18,0,3.35,14,16,100,5,150,30,30,1.3,"Melee","MeleeAttack_Axe",51013,52013,0,0,"광전사6","인간형 몬스터",11,"근접",4.59,"광포화 - 공격력","치명타 피해량20%",null,null,0.90334236675700086,1.5]
[12014,112014,"Normal_Melee",12014,20,40,0,2.2999999999999998,30,32,100,10,130,30,30,1.3,"Melee","MeleeAttack_Sword",51014,52014,0,0,"다크엘프 기사2","인간형 몬스터",25,"근접",13.88,"피해 무효","치명타 5%",null,null,0.90334236675700086,1.4]
[12015,112015,"Normal_Melee",12015,20,40,0,2.25,26,35,100,10,130,30,30,1.3,"Melee","MeleeAttack_Sword",51015,52015,0,0,"다크엘프 기사3","인간형 몬스터",25,"근접",13.96,"피해 무효","치명타 5%",null,null,0.90334236675700086,1.3]
[12016,112016,"Normal_Melee",12016,18,37,0,2.4,22,33,100,10,130,30,30,1.3,"Melee","MeleeAttack_Sword",51016,52016,0,0,"다크엘프 기사4","인간형 몬스터",23,"근접",11.8,"피해 무효","치명타 5%",null,null,0.90334236675700086,1.4]
[12017,112017,"Normal_Range",12017,3,7,17,2.7,7,11,100,3,120,30,30,1.3,"Range","vfx_Projectile_Orb02_Pink",51017,0,0,0,"다크엘프 마법사1","인간형 몬스터",9,"원거리",3.35,"둔화 50%",null,null,null,0.90334236675700086,1.3]
[12018,112018,"Normal_Range",12018,9,19,47,2.75,20,48,100,3,120,30,30,1.3,"Range","vfx_Projectile_Orb06_Purple",51018,0,0,0,"다크엘프 마법사3","인간형 몬스터",24,"원거리",12.44,"회복",null,null,null,0.90334236675700086,1.3]
[12019,112019,"Normal_Range",12019,7,14,35,2.65,20,23,100,3,120,30,30,1.3,"Range","vfx_Projectile_Orb05_Purple",51019,0,0,0,"다크엘프 마법사4","인간형 몬스터",17,"원거리",8.16,"화상",null,null,null,0.90334236675700086,1.2]
[12020,112020,"Normal_Melee",12020,13,27,0,2.9,23,24,100,5,130,30,30,1.3,"Melee","MeleeAttack_Axe",51020,0,0,0,"도살자1","인간형 몬스터",17,"근접",8.23,"중독 5초",null,null,null,0.90334236675700086,1.4]
[12021,112021,"Normal_Melee",12021,14,29,0,2.8,22,24,100,5,130,30,30,1.3,"Melee","MeleeAttack_Axe",51021,0,0,0,"도살자2","인간형 몬스터",18,"근접",8.34,"광전사 2배",null,null,null,0.90334236675700086,1.5]
[12022,112022,"Normal_Melee",12022,14,29,0,1.7,9,19,100,5,130,30,30,1.3,"Melee","MeleeAttack_Sword",51022,0,0,0,"살인 청부업자1","인간형 몬스터",18,"근접",8.36,"치명타 확률 20%",null,null,null,0.90334236675700086,1.3]
[12023,112023,"Normal_Melee",12023,9,18,0,1.65,7,8,100,5,150,30,30,1.3,"Melee","MeleeAttack_DoubleSword",51023,0,0,0,"살인 청부업자2","인간형 몬스터",11,"근접",4.66,"치명타 확률 20%",null,null,null,0.90334236675700086,1.3]
[12024,112024,"Normal_Melee",12024,8,16,0,1.85,7,9,100,5,150,30,30,1.3,"Melee","MeleeAttack_Sword",51024,0,0,0,"살인 청부업자3","인간형 몬스터",10,"근접",4.43,"치명타 확률 20%",null,null,null,0.90334236675700086,1.1000000000000001]
[12025,112025,"Normal_Melee",12025,7,14,0,0.85,3,6,100,5,130,30,30,1.3,"Melee","MeleeAttack_DoubleSword",51025,52025,0,0,"연쇄살인마1","인간형 몬스터",9,"근접",5.37,"공속 빠름","흡혈",null,null,0.90334236675700086,1.3]
[12026,112026,"Normal_Melee",12026,17,35,0,0.9,11,16,100,5,130,30,30,1.3,"Melee","MeleeAttack_Dagger",51026,52026,0,0,"연쇄살인마2","인간형 몬스터",22,"근접",15.23,"공속 빠름","흡혈",null,null,0.90334236675700086,1.3]
[12027,112027,"Normal_Melee",12027,9,18,0,0.9,5,7,100,5,130,30,30,1.3,"Melee","MeleeAttack_Dagger",51027,52027,0,0,"연쇄살인마3","인간형 몬스터",11,"근접",6.77,"공속 빠름","흡혈",null,null,0.90334236675700086,1.1000000000000001]
[12028,112028,"Normal_Range",12028,2,4,0,2.6,3,9,100,3,120,30,30,1.3,"Range","Projectiles_light",51028,0,0,0,"오크 궁수1","인간형 몬스터",5,"원거리",2.3199999999999998,"사망 - 회복",null,null,null,0.90334236675700086,1.3]
[12029,112029,"Normal_Range",12029,3,6,0,2.7,6,9,100,3,120,30,30,1.3,"Range","Projectiles_light",51029,0,0,0,"오크 궁수2","인간형 몬스터",7,"원거리",2.79,"사망 - 회복",null,null,null,0.90334236675700086,1.3]
[12030,112030,"Normal_Range",12030,3,6,0,2.8,5,11,100,3,120,30,30,1.3,"Range","vfx_ToonProjectile_Bomb03Red",51030,0,0,0,"오크 마법사1","인간형 몬스터",7,"원거리",2.87,"사망 - 회복",null,null,null,0.90334236675700086,1.2]
[12031,112031,"Normal_Range",12031,2,5,0,2.85,7,8,100,3,120,30,30,1.3,"Range","vfx_ToonProjectile_Bomb03Blue",51031,0,0,0,"오크 마법사2","인간형 몬스터",6,"원거리",2.65,"사망 - 회복",null,null,null,0.90334236675700086,1.2]
[12032,112032,"Normal_Melee",12032,4,8,0,2.5,3,8,100,5,130,30,30,1.3,"Melee","MeleeAttack_Axe",51032,0,0,0,"오크1","인간형 몬스터",5,"근접",2.23,"사망 - 회복",null,null,null,0.90334236675700086,1.3]
[12033,112033,"Normal_Melee",12033,5,10,0,2.6,5,9,100,5,130,30,30,1.3,"Melee","MeleeAttack_Axe",51033,0,0,0,"오크2","인간형 몬스터",6,"근접",2.73,"사망 - 회복",null,null,null,0.90334236675700086,1.4]
[12034,112034,"Normal_Melee",12034,19,38,0,2.9,36,37,100,5,130,30,30,1.3,"Melee","MeleeAttack_Blunt",51034,0,0,0,"오크 워리어1","인간형 몬스터",24,"근접",12.78,"사망 - 회복",null,null,null,0.90334236675700086,1.4]
[12035,112035,{"$f":"\"Normal_\"&Q96","v":"Normal_Range"},12035,9,19,0,2.4,35,47,100,{"$f":"IF(Z96=\"근접\",5,3)","v":3},{"$f":"IF(Z96=\"근접\",130,120)","v":120},30,30,1.3,"Range","Projectiles_light",51035,52035,0,0,"활든 강도1","인간형 몬스터",24,"원거리",17.190000000000001,"공격력 15%","공속 15%",null,null,0.90334236675700086,1.2]
[12036,112036,"Normal_Range",12036,3,6,0,2.5,7,13,100,3,120,30,30,1.3,"Range","Projectiles_light",51036,52036,0,0,"활든 강도2","인간형 몬스터",8,"원거리",4.0199999999999996,"공격력 15%","공속 15%",null,null,0.90334236675700086,1.2]
[12037,112037,"Normal_Range",12037,4,8,0,2.4500000000000002,7,21,100,3,120,30,30,1.3,"Range","Projectiles_light",51037,52037,0,0,"활든 강도3","인간형 몬스터",10,"원거리",5.75,"공격력 15%","공속 15%",null,null,0.90334236675700086,1.2]
[13001,113001,"Normal_Range",13001,5,10,0,2.9,16,22,100,3,120,30,30,1.3,"Range","Projectiles_magic",61001,62001,0,0,"네크로멘서1","언데드형 몬스터",13,"원거리",{"$f":"ROUND(((I99 + J99) / 2) * (1 + (L99 / 100) * ((M99 / 100) - 1)) / H99 * (K99 / 100),2)","v":6.59},"실드 회복","공격력 20%",null,null,0.90334236675700086,1.3]
[13002,113002,"Normal_Range",13002,5,11,0,2.85,20,22,100,3,120,30,30,1.3,"Range","Projectiles_magic",61002,62002,0,0,"네크로멘서2","언데드형 몬스터",14,"원거리",7.41,"실드 회복","공격력 20%",null,null,0.90334236675700086,1.3]
[13003,113003,"Normal_Range",13003,6,12,0,2.95,21,24,100,3,120,30,30,1.3,"Range","Projectiles_magic",61003,62003,0,0,"네크로멘서3","언데드형 몬스터",15,"원거리",7.67,"실드 회복","공격력 20%",null,null,0.90334236675700086,1.2]
[13004,113004,"Normal_Melee",13004,10,21,0,2.2999999999999998,8,16,100,5,130,30,30,1.3,"Melee","MeleeAttack_Scythe",61004,0,0,0,"데스1","언데드형 몬스터",13,"근접",5.3,"사망 회복",null,null,null,0.90334236675700086,1.3]
[13005,113005,"Normal_Melee",13005,11,22,0,2.35,14,15,100,5,130,30,30,1.3,"Melee","MeleeAttack_Scythe",61005,0,0,0,"데스2","언데드형 몬스터",14,"근접",6.26,"사망 회복",null,null,null,0.90334236675700086,1.3]
[13006,113006,"Normal_Melee",13006,18,37,0,2.1,23,25,100,5,130,30,30,1.3,"Melee","MeleeAttack_Sword",61006,0,0,0,"데스나이트2","언데드형 몬스터",23,"근접",11.6,"공격력 증가",null,null,null,0.90334236675700086,1.4]
[13007,113007,"Normal_Melee",13007,10,21,0,2.4,12,13,100,5,130,30,30,1.3,"Melee","FX_Kick",61007,0,0,0,"머미1","언데드형 몬스터",13,"근접",5.29,"중독 5초",null,null,null,0.90334236675700086,1.1000000000000001]
[13008,113008,"Normal_Melee",13008,11,22,0,2.4500000000000002,11,19,100,5,130,30,30,1.3,"Melee","FX_Kick",61008,0,0,0,"머미2","언데드형 몬스터",14,"근접",6.21,"중독 5초",null,null,null,0.90334236675700086,1.2]
[13009,113009,"Normal_Melee",13009,20,40,0,2.35,28,34,100,5,130,30,30,1.3,"Melee","FX_Kick",61009,0,0,0,"머미3","언데드형 몬스터",25,"근접",13.39,"중독 5초",null,null,null,0.90334236675700086,1.2]
[13010,113010,"Normal_Range",13010,10,20,0,2.8,30,44,100,3,120,30,30,1.3,"Range","vfx_Projectile_Orb13_DarkPurple",61010,0,0,0,"바포메트1","언데드형 몬스터",25,"원거리",13.29,"광포화",null,null,null,0.90334236675700086,1.5]
[13011,113011,"Normal_Range",13011,13,26,0,2.9,70,78,100,3,120,30,30,1.3,"Range","vfx_Projectile_Orb13_DarkRed",61011,0,0,0,"바포메트3","언데드형 몬스터",32,"원거리",25.67,"광포화",null,null,null,0.90334236675700086,1.3]
[13012,113012,"Normal_Range",13012,10,21,0,2.85,24,62,100,3,120,30,30,1.3,"Range","vfx_ToonProjectile_Bomb03Red",61012,0,0,0,"바포메트4","언데드형 몬스터",26,"원거리",15.18,"광포화",null,null,null,0.90334236675700086,1.2]
[13013,113013,"Normal_Range",13013,12,25,0,2.95,62,74,100,3,120,30,30,1.3,"Range","vfx_Projectile_Orb13_DarkPurple",61013,0,0,0,"바포메트5","언데드형 몬스터",31,"원거리",23.19,"광포화",null,null,null,0.90334236675700086,1.2]
[13014,113014,"Normal_Melee",13014,4,8,0,2.2000000000000002,4,6,100,5,130,30,30,1.3,"Melee","FX_Double Claw",61014,0,0,0,"사악한 악령1","언데드형 몬스터",5,"근접",2.31,"실드 증가",null,null,null,0.90334236675700086,1.3]
[13015,113015,"Normal_Melee",13015,10,21,0,2.15,10,13,100,5,130,30,30,1.3,"Melee","FX_Double Claw",61015,0,0,0,"사악한 악령2","언데드형 몬스터",13,"근접",5.43,"실드 증가",null,null,null,0.90334236675700086,1.3]
[13016,113016,"Normal_Range",13016,12,24,0,2.8,54,64,100,3,120,30,30,1.3,"Range","vfx_Projectile_Orb02_Pink",61016,0,0,0,"악마 광신자1","언데드형 몬스터",30,"원거리",21.2,"회복",null,null,null,0.90334236675700086,1.2]
[13017,113017,"Normal_Range",13017,4,9,0,2.85,12,15,100,3,120,30,30,1.3,"Range","vfx_Projectile_Orb13_DarkPurple",61017,0,0,0,"악마 광신자2","언데드형 몬스터",11,"원거리",4.7699999999999996,"회복",null,null,null,0.90334236675700086,1.2]
[13018,113018,"Normal_Range",13018,9,18,0,2.9,32,35,100,3,120,30,30,1.3,"Range","vfx_Projectile_Orb13_DarkRed",61018,0,0,0,"악마 광신자3","언데드형 몬스터",23,"원거리",11.62,"회복",null,null,null,0.90334236675700086,1.2]
[13019,113019,"Normal_Range",13019,6,12,0,2.75,17,20,100,3,120,30,30,1.3,"Range","vfx_Projectile_Orb05_Purple",61019,0,0,0,"악마 광신자4","언데드형 몬스터",15,"원거리",6.77,"회복",null,null,null,0.90334236675700086,1.2]
[13020,113020,"Normal_Melee",13020,17,35,0,2.15,15,30,100,5,130,30,30,1.3,"Melee","MeleeAttack_Dagger",61020,0,0,0,"악마 추종자1","언데드형 몬스터",22,"근접",10.62,"중독 5초",null,null,null,0.90334236675700086,1.1000000000000001]
[13021,113021,"Normal_Melee",13021,21,42,0,2.2000000000000002,26,42,100,5,130,30,30,1.3,"Melee","FX_Double Claw",61021,0,0,0,"악마 추종자2","언데드형 몬스터",26,"근접",15.69,"자폭",null,null,null,0.90334236675700086,1.1000000000000001]
[13022,113022,"Normal_Melee",13022,21,42,0,2.0499999999999998,29,33,100,20,150,30,30,1.3,"Melee","MeleeAttack_Dagger",61022,62022,0,0,"악마 추종자3","언데드형 몬스터",26,"근접",16.63,"치명타 15%","치명타 피해량 20%",null,null,0.90334236675700086,1.1000000000000001]
[13023,113023,"Normal_Melee",13023,10,21,0,1.9,9,12,100,5,130,30,30,1.3,"Melee","FX_Kick",61023,0,0,0,"임프 사역마1","언데드형 몬스터",13,"근접",5.61,"회피력","회피력",null,null,0.90334236675700086,1.3]
[13024,113024,"Normal_Melee",13024,13,27,0,1.95,13,18,100,5,130,30,30,1.3,"Melee","FX_Kick",61024,0,0,0,"임프 사역마2","언데드형 몬스터",17,"근접",8.07,"회피력","회피력",null,null,0.90334236675700086,1.5]
[13025,113025,"Normal_Melee",13025,14,29,0,2.2000000000000002,16,20,100,5,130,30,30,1.3,"Melee","MeleeAttack_Sword",61025,0,0,0,"타락한 기사1","언데드형 몬스터",18,"근접",8.3000000000000007,"피해 무효",null,null,null,0.90334236675700086,1.4]
[13026,113026,"Normal_Melee",13026,11,22,0,2.25,12,16,100,5,130,30,30,1.3,"Melee","MeleeAttack_Sword",61026,0,0,0,"타락한 기사2","언데드형 몬스터",14,"근접",6.32,"피해 무효",null,null,null,0.90334236675700086,1.4]
[13027,113027,"Normal_Melee",13027,21,42,0,2.15,26,39,100,5,130,30,30,1.3,"Melee","MeleeAttack_Sword",61027,0,0,0,"타락한 기사3","언데드형 몬스터",26,"근접",15.34,"피해 무효",null,null,null,0.90334236675700086,1.5]
[13028,113028,"Normal_Range",13028,6,13,0,2.85,18,25,100,3,120,30,30,1.3,"Range","Projectiles_light",61028,61028,0,0,"해골 궁수","언데드형 몬스터",16,"원거리",7.59,"부활","버서커 공속",null,null,0.90334236675700086,2.6]
[13029,113029,"Normal_Melee",13029,13,26,0,2.6,18,21,100,5,130,30,30,1.3,"Melee","MeleeAttack_Scythe",61029,61029,0,0,"해골 근위병","언데드형 몬스터",16,"근접",7.61,"부활","피해 무효",null,null,0.90334236675700086,2.6]
[13030,113030,"Normal_Range",13030,9,18,0,3.05,26,38,100,3,120,30,30,1.3,"Range","vfx_Projectile_Orb04_Yellow",61030,61030,0,0,"해골 법사","언데드형 몬스터",22,"원거리",10.55,"부활","회복",null,null,0.90334236675700086,2.6]
[13031,113031,"Normal_Melee",13031,13,26,0,2.4,17,19,100,5,130,30,30,1.3,"Melee","MeleeAttack_Sword",61031,0,0,0,"해골 기사1","언데드형 몬스터",16,"근접",7.61,"부활",null,null,null,0.90334236675700086,1.5]
[13032,113032,"Normal_Melee",13032,17,34,0,2.35,11,36,100,5,130,30,30,1.3,"Melee","MeleeAttack_Sword",61032,0,0,0,"해골 기사2","언데드형 몬스터",21,"근접",10.15,"부활",null,null,null,0.90334236675700086,1.5]
[13033,113033,"Normal_Melee",13033,17,35,0,2.1,19,25,100,5,130,30,30,1.3,"Melee","MeleeAttack_Sword",61033,0,0,0,"해골 기사3","언데드형 몬스터",22,"근접",{"$f":"ROUND(((I131 + J131) / 2) * (1 + (L131 / 100) * ((M131 / 100) - 1)) / H131 * (K131 / 100),2)","v":10.63},"부활",null,null,null,0.90334236675700086,1.4]
[13034,{"$f":"A132+100000","v":113034},"Normal_Melee",{"$f":"A132","v":13034},17,35,0,2.0499999999999998,20,23,100,5,130,30,30,1.3,{"$f":"IF(Z132=\"원거리\",\"Range\",\"Melee\")","v":"Melee"},"MeleeAttack_Sword",61034,0,0,0,"해골 기사4","언데드형 몬스터",22,"근접",10.65,"부활",null,null,null,{"$f":"$AF$2/(N132*3.69)","v":0.90334236675700086},1.3]
[14001,114001,"Normal_Melee",14001,1,2,0,2,2,3,100,5,130,30,30,1.3,"Melee","FX_Kick",71001,0,0,0,"펑거스","마법 생물",1,"근접",1.27,"중독 5초",null,null,null,0.90334236675700086,2.6]
[14002,114002,"Normal_Melee",14002,1,2,0,1.95,2,3,100,5,130,30,30,1.3,"Melee","FX_Double Claw",0,0,0,0,"동굴 박쥐","마법 생물",1,"근접",1.3,null,null,null,null,0.90334236675700086,2.1]
[14003,114003,"Normal_Range",14003,1,3,0,2.1,3,5,100,3,120,30,30,1.3,"Range","FX_Double Claw",71003,0,0,0,"만드레고라","마법 생물",2,"원거리",1.92,"중독 5초",null,null,null,0.90334236675700086,2.5]
[14004,114004,"Normal_Melee",14004,21,43,0,2.25,36,38,100,5,130,30,30,1.3,"Melee","MeleeAttack_Blow",71004,0,0,0,"켄타우로스","마법 생물",27,"근접",16.690000000000001,"광전사 2배",null,null,null,0.90334236675700086,3]
[14005,114005,"Normal_Melee",14005,18,37,0,1.9,21,22,100,5,130,30,30,1.3,"Melee","MeleeAttack_Claw",71005,0,0,0,"무리안","마법 생물",23,"근접",11.49,"슬로우",null,null,null,0.90334236675700086,1.4]
[14006,114006,"Normal_Melee",14006,21,43,0,1.85,29,31,100,15,150,30,30,1.3,"Melee","MeleeAttack_Claw",71006,72006,0,0,"타이가","마법 생물",27,"근접",17.43,"치명타 확률","치명타 피해량",null,null,0.90334236675700086,1.4]
[14007,114007,"Normal_Melee",14007,14,29,0,2,16,17,100,5,130,30,30,1.3,"Melee","FX_Double Claw",71007,0,0,0,"구울1","마법 생물",18,"근접",8.3699999999999992,"광전사 공격력",null,null,null,0.90334236675700086,1.2]
[14008,114008,"Normal_Melee",14008,15,30,0,1.95,12,22,100,5,130,30,30,1.3,"Melee","FX_Double Claw",71008,0,0,0,"구울2","마법 생물",19,"근접",8.85,"광전사 공격력",null,null,null,0.90334236675700086,1.2]
[14009,114009,"Normal_Melee",14009,15,30,0,1.95,9,25,100,5,130,30,30,1.3,"Melee","FX_Double Claw",71009,0,0,0,"구울3","마법 생물",19,"근접",8.85,"광전사 공격력",null,null,null,0.90334236675700086,1.2]
[14010,114010,"Normal_Melee",14010,15,30,0,1.8,15,16,100,15,130,30,30,1.3,"Melee","MeleeAttack_Claw",71010,0,0,0,"다이어울프1","마법 생물",19,"근접",9,"치명타 확률",null,null,null,0.90334236675700086,1.3]
[14011,114011,"Normal_Melee",14011,15,30,0,1.9,15,18,100,15,130,30,30,1.3,"Melee","MeleeAttack_Claw",71011,0,0,0,"다이어울프2","마법 생물",19,"근접",9.08,"치명타 확률",null,null,null,0.90334236675700086,1.2]
[14012,114012,"Normal_Melee",14012,5,10,0,2.2000000000000002,2,10,100,5,130,30,30,1.3,"Melee","FX_Kick",71012,0,0,0,"데스웜","마법 생물",6,"근접",2.77,"회복",null,null,null,0.90334236675700086,1.3]
[14013,114013,"Normal_Melee",14013,1,2,0,2.1,2,3,100,5,130,30,30,1.3,"Melee","FX_Kick",71013,0,0,0,"동굴쥐1","마법 생물",1,"근접",1.21,"중독 5초",null,null,null,0.90334236675700086,0.9]
[14014,114014,"Normal_Melee",14014,2,5,0,2.25,2,7,100,5,130,30,30,1.3,"Melee","FX_Kick",71014,0,0,0,"동굴쥐2","마법 생물",3,"근접",2.0299999999999998,"중독 5초",null,null,null,0.90334236675700086,1.1000000000000001]
[14015,114015,"Normal_Melee",14015,21,43,0,2,31,34,100,5,130,30,30,1.3,"Melee","MeleeAttack_Sword",71015,72015,0,0,"리자드맨","마법 생물",27,"근접",16.489999999999998,"치명타 확률","치명타 피해",null,null,0.90334236675700086,1.5]
[14016,114016,"Normal_Melee",14016,20,40,0,2.15,28,29,100,5,130,30,30,1.3,"Melee","MeleeAttack_Claw",71016,0,0,0,"맹독사1","마법 생물",25,"근접",13.45,"중독 5초",null,null,null,0.90334236675700086,1.3]
[14017,114017,"Normal_Melee",14017,1,3,0,2.15,3,4,100,5,130,30,30,1.3,"Melee","MeleeAttack_Claw",71017,0,0,0,"맹독사2","마법 생물",2,"근접",1.65,"중독 5초",null,null,null,0.90334236675700086,1.2]
[14018,114018,"Normal_Melee",14018,1,2,0,2.2000000000000002,2,4,100,5,130,30,30,1.3,"Melee","FX_Kick",0,0,0,0,"미믹","마법 생물",1,"근접",1.38,"-",null,null,null,0.90334236675700086,1.1000000000000001]
[14019,114019,"Normal_Melee",14019,21,43,0,1.8,23,36,100,5,130,30,30,1.3,"Melee","MeleeAttack_Claw",71019,0,0,0,"셀로브","마법 생물",27,"근접",16.63,"슬로우",null,null,null,0.90334236675700086,1.4]
[14020,114020,"Normal_Melee",14020,20,40,0,2,19,34,100,5,130,35,35,1.3,"Melee","FX_Double Claw",71020,0,0,0,"스프리트","마법 생물",25,"근접",13.45,"회피력","회피력",null,null,0.77429345722028642,1.8]
[14021,114021,"Normal_Range",14021,1,3,0,2.15,3,5,100,3,120,30,30,1.3,"Range","FX_Kick",71021,0,0,0,"슬라임1","마법 생물",2,"원거리",1.87,"회복",null,null,null,0.90334236675700086,1.1000000000000001]
[14022,114022,"Normal_Range",14022,3,6,0,2.25,3,7,100,3,120,30,30,1.3,"Range","FX_Kick",71022,0,0,0,"슬라임2","마법 생물",3,"원거리",2.2400000000000002,"회복",null,null,null,0.90334236675700086,0.8]
[14023,114023,"Normal_Melee",14023,16,32,0,1.95,15,21,100,5,130,30,30,1.3,"Melee","FX_Kick",71023,0,0,0,"임프1","마법 생물",20,"근접",9.3699999999999992,"사망-성장",null,null,null,0.90334236675700086,1.2]
[14024,114024,"Normal_Melee",14024,1,3,0,2,2,5,100,5,130,30,30,1.3,"Melee","FX_Kick",0,0,0,0,"임프2","마법 생물",2,"근접",1.78,null,null,null,null,0.90334236675700086,1.2]
[14025,114025,"Normal_Melee",14025,16,32,0,1.95,12,24,100,5,130,30,30,1.3,"Melee","FX_Kick",71025,0,0,0,"임프3","마법 생물",20,"근접",9.3699999999999992,"사망 회복",null,null,null,0.90334236675700086,1.1000000000000001]
[14026,114026,"Normal_Melee",14026,21,42,0,2,28,33,100,5,130,30,30,1.3,"Melee","FX_Kick",71026,0,0,0,"임프4","마법 생물",26,"근접",15.48,"사망 공격력",null,null,null,0.90334236675700086,1.1000000000000001]
[14027,114027,"Normal_Range",14027,6,13,0,2.7,18,23,100,3,120,30,30,1.3,"Range","vfx_ToonProjectile_Bomb03Red",71027,0,0,0,"임프 마법사1","마법 생물",16,"원거리",7.64,"사망 공격력",null,null,null,0.90334236675700086,1.2]
[14028,114028,{"$f":"\"Normal_\"&Q160","v":"Normal_Range"},14028,11,22,0,2.75,48,52,100,{"$f":"IF(Z160=\"근접\",5,3)","v":3},{"$f":"IF(Z160=\"근접\",130,120)","v":120},30,30,1.3,"Range","vfx_ToonProjectile_Bomb02Red",71028,0,0,0,"임프 마법사2","마법 생물",29,"원거리",18.29,"사망 공속",null,null,null,0.90334236675700086,1.2]
[14029,114029,"Normal_Range",14029,7,15,0,2.65,18,28,100,3,120,30,30,1.3,"Range","vfx_ToonProjectile_Bomb03Red",71029,0,0,0,"임프 마법사3","마법 생물",19,"원거리",8.73,"화상",null,null,null,0.90334236675700086,1.2]
[14030,114030,"Normal_Range",14030,8,16,0,2.6,23,26,100,3,120,30,30,1.3,"Range","vfx_ToonProjectile_Bomb02Red",71030,0,0,0,"임프 마법사4","마법 생물",20,"원거리",9.48,"사망 회복",null,null,null,0.90334236675700086,1.1000000000000001]
[14031,114031,"Normal_Melee",14031,16,32,0,2.0499999999999998,16,22,100,5,130,30,30,1.3,"Melee","MeleeAttack_Sword",71031,0,0,0,"임프 전사2","마법 생물",20,"근접",{"$f":"ROUND(((I163 + J163) / 2) * (1 + (L163 / 100) * ((M163 / 100) - 1)) / H163 * (K163 / 100),2)","v":9.41},"사망-성장",null,null,null,0.90334236675700086,1.2]
[14032,114032,"Normal_Melee",14032,15,30,0,2.1,14,22,100,5,130,30,30,1.3,"Melee","MeleeAttack_Sword",71032,0,0,0,"임프 전사3","마법 생물",19,"근접",8.6999999999999993,"사망-성장",null,null,null,0.90334236675700086,1.3]
[14033,114033,"Normal_Melee",14033,22,45,0,2,23,50,100,15,130,30,30,1.3,"Melee","FX_Double Claw",71033,72033,0,0,"하피","마법 생물",29,"근접",19.07,"부활","치명타",null,null,0.90334236675700086,1.6]
[14034,114034,"Normal_Melee",14034,17,34,0,2.15,18,25,100,5,130,30,30,1.3,"Melee","MeleeAttack_Claw",71034,0,0,0,"흡혈귀1","마법 생물",20,"근접",10.15,"흡혈",null,null,null,0.90334236675700086,1.2]
[15001,115001,"Normal_Melee",15001,23,46,0,3,34,104,100,15,130,30,30,1.3,"Melee","MeleeAttack_Axe",81001,82001,0,0,"싸이 전사","거인 종족",29,"근접",24.04,"공격력","치명타",null,null,0.90334236675700086,3.3]
[15002,115002,"Normal_Range",15002,11,26,0,3.5,38,115,100,3,120,30,30,1.3,"Range","vfx_Projectile_Fireball03_Orange",81002,82002,0,0,"헤츨링1","거인 종족",27,"원거리",21.99,"생명력 20%","공격력 20%",null,null,0.90334236675700086,1.6]
[15003,115003,"Normal_Range",15003,13,31,0,3.25,62,105,100,3,120,30,30,1.3,"Range","vfx_Projectile_Fireball03_Green",81003,82003,0,0,"헤츨링2","거인 종족",32,"원거리",25.85,"생명력 20%","화상",null,null,0.90334236675700086,1.6]
[15004,115004,"Normal_Melee",15004,25,50,0,3.2,84,91,100,5,130,30,30,1.3,"Melee","MeleeAttack_Blunt",81004,0,0,0,"약탈꾼1","거인 종족",31,"근접",27.75,"공격력",null,null,null,0.90334236675700086,1.7]
[15005,115005,"Normal_Melee",15005,23,46,0,3.3,72,81,100,5,130,30,30,1.3,"Melee","MeleeAttack_Blunt",81005,0,0,0,"약탈꾼2","거인 종족",29,"근접",23.53,"공격력",null,null,null,0.90334236675700086,1.6]
[15006,115006,"Normal_Melee",15006,25,50,0,3.5,37,156,100,5,130,30,30,1.3,"Melee","MeleeAttack_Blunt",81006,0,0,0,"엘더 예티1","거인 종족",31,"근접",27.99,"공격력",null,null,null,0.90334236675700086,1.8]
[15007,115007,"Normal_Melee",15007,25,51,0,3.65,98,124,100,5,130,30,30,1.3,"Melee","MeleeAttack_Blunt",81007,82007,0,0,"엘더 예티2","거인 종족",32,"근접",30.87,"공격력","버서커 공격력",null,null,0.90334236675700086,1.8]
[15008,115008,"Normal_Melee",15008,25,50,0,3.7,21,184,100,5,130,30,30,1.3,"Melee","MeleeAttack_Blunt",81008,82008,0,0,"예티3","거인 종족",31,"근접",28.12,"공격력","버서커 공격력",null,null,0.90334236675700086,1.8]
[15009,115009,"Normal_Melee",15009,25,60,0,3.2,68,110,100,5,130,30,30,1.3,"Melee","MeleeAttack_Blunt",81009,82009,0,0,"예티5","거인 종족",31,"근접",28.23,"공격력","생명",null,null,0.90334236675700086,1.8]
[15010,115010,"Normal_Melee",15010,23,55,0,3.25,38,114,100,5,130,30,30,1.3,"Melee","MeleeAttack_Blunt",81010,82010,0,0,"예티6","거인 종족",29,"근접",23.74,"공격력","생명",null,null,0.90334236675700086,1.9]
[15011,115011,"Normal_Melee",15011,25,50,0,3,66,74,100,5,130,30,30,1.3,"Melee","MeleeAttack_Blunt",81011,0,0,0,"오우거2","거인 종족",31,"근접",23.68,"생명력",null,null,null,0.90334236675700086,1.9]
[15012,115012,"Normal_Melee",15012,22,45,0,3.1,50,62,100,5,130,30,30,1.3,"Melee","MeleeAttack_Blunt",81012,0,0,0,"오우거3","거인 종족",27,"근접",18.34,"생명력",null,null,null,0.90334236675700086,1.9]
[15013,115013,"Normal_Melee",15013,24,58,0,3.45,28,118,100,5,130,30,30,1.3,"Melee","MeleeAttack_Blow",81013,82013,0,0,"용암골렘1","거인 종족",30,"근접",21.48,"화상","생명력",null,null,0.90334236675700086,2]
[15014,115014,"Normal_Melee",15014,24,58,0,2.95,46,80,100,5,150,30,30,1.3,"Melee","MeleeAttack_Blunt",81014,82014,0,0,"트롤 워리어1","거인 종족",30,"근접",21.89,"생명력","치명타 피해량",null,null,0.90334236675700086,2]
[15015,115015,"Normal_Melee",15015,23,46,0,2.9,21,114,100,5,150,30,30,1.3,"Melee","MeleeAttack_Blunt",81015,82015,0,0,"트롤 워리어2","거인 종족",29,"근접",23.86,"공격력","치명타 피해량",null,null,0.90334236675700086,2]
[15016,115016,"Normal_Melee",15016,24,48,0,2.95,58,68,100,5,150,30,30,1.3,"Melee","MeleeAttack_Blunt",81016,82016,0,0,"트롤 워리어3","거인 종족",30,"근접",21.89,"실드","치명타 피해량",null,null,0.90334236675700086,1.8]
[15017,115017,"Normal_Melee",15017,24,58,0,3,33,95,100,5,150,30,30,1.3,"Melee","MeleeAttack_Blunt",81017,82017,0,0,"트롤 워리어5","거인 종족",30,"근접",21.87,"생명력","치명타 피해량",null,null,0.90334236675700086,1.9]
[15018,115018,"Normal_Melee",15018,25,62,0,3.1,33,156,100,5,130,30,30,1.3,"Melee","MeleeAttack_Blunt",81018,82018,0,0,"트롤 워리어6","거인 종족",32,"근접",30.94,"생명력","공격력 20%",null,null,0.90334236675700086,1.8]
[15019,115019,"Normal_Melee",{"$f":"A185","v":15019},25,62,0,3.15,72,120,100,5,130,30,30,1.3,"Melee","MeleeAttack_Blunt",81019,82019,0,0,"트롤 워리어7","거인 종족",32,"근접",30.93,"생명력","공격력 20%",null,null,0.90334236675700086,1.8]

{"sheet":"CardList","index":19,"n_rows":112,"n_cols":14,"rows_kept":112,"cut":false,"hidden":false,"merged":[]}
["n_ID","e_CardType","n_CardGrade","s_Value1","s_Value2","s_Value3","n_ProjectileCount","f_ProjectileDelayTime","e_StatusConditionsType","s_Projectile","e_ProjectileAttackType","n_Desc","b_Percent","exception"]
["_카드 ID (서버저장)","카드 타입","카드 등급","값1","값2","값3","투사체 개수(기본 1)","투사체 쏘는 딜레이(초)","상태이상","투사체","투사체 공격타입","카드 설명","%표시","참고용 텍스트"]
[1001,"G1_AddPotion",1,1,1,0,1,0,"Max","FX_LightUpSmoke","Melee",101001,false,"물약 최대 보유량을 +1 추가하고, 물약을 1개를 획득합니다."]
[1002,"G1_FirstAttack",1,0,3,0,1,0,"Max","FX_Red Slash_Impact","Melee",101002,true,"전투 시작 후 첫 번째 공격은 +300%의 피해를 입힙니다."]
[1003,"G1_AddMaxAttack",1,2,0,0,1,0,"Max",null,"Melee",101003,false,"최대 피해가 +2 증가합니다."]
[1004,"G1_AddMinAttack",1,1,0,0,1,0,"Max",null,"Melee",101004,false,"최소 피해가 +1 증가합니다."]
[1005,"G1_IllusionSpear",1,0,1,0,1,0,"Max","FX_BlueCharge","Melee",101005,false,"전투 시작 후 첫 번째 공격은 후열의 적에게도 피해를 입히는 환영의 창을 시전합니다."]
[1006,"G1_AddHitRate",1,5,0,0,1,0,"Max","LevelUp2","Melee",101006,false,"명중력이 +5 증가합니다."]
[1007,"G1_ElectricShockOnConsecutiveHits",1,8,6,0,1,0,"Max","FX_Cartoon Thunder","Melee",101007,true,"빗나감 없이 6회 공격을 명중할 때마다 전기 충격을 시전합니다."]
[1008,"G1_SanctuaryHeal",1,0,2,0,1,0,"Max","EnergyBlast","Melee",101008,true,"회복의 성소에서 얻는 회복 효과와 경험치가 +200% 증가합니다."]
[1009,"G1_MagicMissile",1,4,0,"8s",3,0.5,"Max","BlueCannonBullet","Range",101009,false,"전투 시작 후 매 8초가 지날 때마다 무작위 적에게 매직 미사일을 3발 발사합니다."]
[1010,"G1_AddCriDmg",1,0,1,0,1,0,"Max","LevelUp3","Melee",101010,false,"치명타 피해량이 x1배 증가합니다."]
[1011,"G1_LifeStealOnDodge",1,2,0,0,1,0,"Max",null,"Melee",101011,false,"회피 발동 시 무작위 적의 생명력 2를 흡혈합니다."]
[1012,"G1_XpGainOnCritKill",1,0,1.5,0,1,0,"Max",null,"Melee",101012,true,"치명타 처치 시 경험치를 +150% 획득합니다."]
[1013,"G1_InstantCastMysticExplosion",1,0,0,0,1,0,"Max","FX_Icelight_Seal","Melee",101013,false,"신비한 폭발 스킬 1회를 즉시 시전합니다. (※즉시 시전 : 카드 획득 시점에만 발동)"]
[1014,"G1_HolyDamageOnMeleeFrontAppear",1,1,0,0,1,0,"Max","Magic Door_Purple","Melee",101014,false,"근접 적이 전열에 등장할 때마다 1의 신성 피해를 입힙니다."]
[1015,"G1_NullifyDamageEveryNHits",1,8,0,0,1,0,"Max",null,"Melee",101015,false,"공격을 8회 받을 때마다 받는 피해를 무효화 합니다."]
[1016,"G1_DodgeNextNAttacks",1,7,0,0,1,0,"Max",null,"Melee",101016,false,"다음 7회의 공격을 무조건 회피합니다."]
[1017,"G1_HolyDamageToBackEnemiesOnDodge",1,1,0,0,1,0,"Max","Magic Door_Purple","Melee",101017,false,"회피 시 후열에 있는 모든 적에게 1의 신성 피해를 입힙니다."]
[1018,"G1_DarkMissileFromPotion",1,0,2,0,1,0,"Max","Magic Door_Purple","Range",101018,true,"물약은 전열의 임의의 적에게 +200%의 피해를 입히는 암흑 미사일을 시전합니다."]
[1019,"G1_NoSimultaneousHpShieldLoss",1,0,0,0,1,0,"Max",null,"Melee",101019,false,"적 공격이 생명력과 보호막을 동시에 감소시키지 않습니다."]
[1020,"G1_CurseExplosionOnKill",1,0,0,0,1,0,"Max",null,"Melee",101020,false,"즉시 임의의 적에게 저주 효과를 부여해 처치 시 시체 폭파를 일으킵니다."]
[1021,"G1_AngelFeatherHeal",1,0,2,0,1,0,"Max",null,"Melee",101021,true,"부활 발동 시 회복되는 생명력이 +200% 늘어납니다."]
[1022,"G1_HealOnRangedHit",1,1,0,0,1,0,"Max",null,"Melee",101022,false,"원거리 공격을 받을 때마다 생명력을 1 회복합니다."]
[1023,"G1_FireMagicMissiles",1,4,0,0,8,0.3,"Max","BlueCannonBullet","Range",101023,false,"8발의 매직 미사일을 무작위 적에게 즉시 발사합니다."]
[1024,"G1_ReflectOnRangedDodge",1,0,0,0,1,0,"Max",null,"Melee",101024,false,"원거리 공격 회피 시 공격을 반사합니다."]
[1025,"G1_HealOnDoubleDodge",1,2,10,0,1,0,"Max",null,"Melee",101025,false,"연속 2회 회피 성공 시 생명력을 10 회복합니다."]
[1026,"G1_LightningToBackOnMeleeDodge",1,0,0,0,1,0,"Max","FX_Cartoon Thunder","Melee",101026,false,"근거리 적 공격 회피 시 후열의 적에게 낙뢰 피해를 입힙니다."]
[1027,"G1_LifeStealToRandomAll",1,20,0,0,1,0,"Max",null,"Melee",101027,false,"전장의 모든 무작위 적에게 생명력 20을 흡혈합니다."]
[1028,"G1_LifeStealOnBackAttack",1,3,0,0,1,0,"Max",null,"Range",101028,false,"후열의 적 공격 시 무작위 적의 생명력 3을 흡혈합니다."]
[1029,"G1_ShieldOnRangedDodge",1,6,0,0,1,0,"Max",null,"Melee",101029,false,"원거리 적 공격 회피 시 보호막을 6만큼 회복합니다."]
[1030,"G1_ThirdCritDamage",1,3,3,0,1,0,"Max",null,"Melee",101030,true,"3번 째 치명타는 +300%의 피해를 입힙니다."]
[1031,"G1_FifthAttackBack",1,5,1.5,0,1,0,"Max","Magic Door_Purple","Melee",101031,true,"5번째 공격마다 후열의 적에게 150% 피해를 입힙니다."]
[1032,"G1_FirstAttackHeals",1,5,0,0,1,0,"Max",null,"Melee",101032,false,"전투 시작 후 첫 번째 공격은 생명력을 5 회복합니다."]
[1033,"G1_FirstAttackShieldPercent",1,0,0.05,0,1,0,"Max",null,"Melee",101033,true,"전투 시작 후 첫 번째 공격 후 보호막을 5% 회복합니다."]
[1034,"G1_AutoUsePotionOnDeath",1,0,0,0,1,0,"Max",null,"Melee",101034,false,"물약 보유 시 생명력이 0이 될 때 자동으로 사용합니다."]
[1035,"G1_GainGoldOnSanctuaryFind",1,10,0,0,1,0,"Max",null,"Melee",101035,false,"임의의 성소을 발견하면 골드를 획득합니다."]
[1036,"G1_MaxHpPlusOnFountain",1,2,0,0,1,0,"Max",null,"Melee",101036,false,"샘물을 발견 시 최대 HP를 2증가 시킵니다."]
[1037,"G1_ShieldHealOnHealFountain",1,0,0,0,1,0,"Max",null,"Melee",101037,false,"회복의 샘에서 회복 효과가 발생 될 때 보호막도 동일하게 회복 됩니다."]
[1038,"G1_ShieldOnFullHeal",1,12,0,0,1,0,"Max",null,"Melee",101038,false,"완전히 회복할 때 보호막을 12 회복합니다."]
[1039,"G1_ThunderOnFifthHit",1,5,2.5,0,1,0,"Max","FX_Cartoon Thunder","Melee",101039,true,"5번째 공격이 명중할 때마다 250% 피해를 입히는 낙뢰를 시전합니다."]
[1040,"G1_GetRandomRareOrEpicSkill",1,0,0,0,1,0,"Max",null,"Melee",101040,false,"즉시 무작위 고급 또는 희귀 스킬 1개를 획득합니다."]
[1041,"G1_HealOnGoldDrop",1,5,0,0,1,0,"Max",null,"Melee",101041,false,"적이 골드를 떨어뜨릴 때마다 생명력을 5 회복 시킵니다."]
[1042,"G1_ShockDamageOnGoldDrop",1,8,0,0,1,0,"Max","FX_Cartoon Thunder","Melee",101042,false,"적이 골드를 떨어뜨릴 때마다 임의의 적에게 전기 충격 피해를 입힙니다."]
[1043,"G1_FullShieldIfHpLowAndShieldZero",1,1,0,0,1,0,"Max",null,"Melee",101043,false,"보호막이 0인 상태에서 생명력이 1만 남아 있을 경우,. 보호막을 완전 회복합니다."]
[1044,"G1_HealOnLevelUp",1,7,0,0,1,0,"Max",null,"Melee",101044,false,"매 레벨 업 할 때마다 생명력을 7 회복합니다."]
[1045,"G1_FountainGivesXp",1,"5exp",0,0,1,0,"Max",null,"Melee",101045,false,"회복의 샘도 경험치를 제공합니다."]
[1046,"G1_FullHealAfterKillsOnce",1,10,0,0,1,0,"Max",null,"Melee",101046,false,"적 10명 처치 후 완전 회복(매 전투 당 1회만 발동)"]
[1047,"G1_HealHpOnShieldBreak",1,10,0,0,1,0,"Max",null,"Melee",101047,false,"보호막 소진 시 생명력 10 회복"]
[1048,"G1_CampHealShield",1,5,0,0,1,0,"Max",null,"Melee",101048,false,"캠프에서 보호막도 함께 회복됩니다."]
[1049,"G1_HealOnRangedHitChance",1,3,0.3,0,1,0,"Max",null,"Melee",101049,true,"원거리 공격에 피격 될 경우 30% 확률로 생명력을 3 회복합니다."]
[1050,"G1_HolyDamageOnHeal",1,5,0,0,1,0,"Max","Magic Door_Purple","Melee",101050,false,"회복 효과가 발생되면 무작위 적에게 5의 신성 피해를 입힙니다."]
[1051,"G1_InstantFullHeal",1,0,0,0,1,0,"Max",null,"Melee",101051,false,"지금 즉시 생명력을 완전 회복합니다."]
[1052,"G1_HealEverySecOutOfCombat",1,5,0,"4s",1,0,"Max",null,"Melee",101052,false,"비 전투 상태로 던전 탐험 시 4초마다 생명력을 5 회복합니다."]
[1053,"G1_MaxDodgeWhenHpBelow",1,4,0,0,1,0,"Max",null,"Melee",101053,false,"생명력이 4이하일 때 회피 확률이 최대치로 고정됩니다."]
[1054,"G1_GoldDropChanceUp",1,0,0.3,0,1,0,"Max",null,"Melee",101054,true,"적이 골드를 떨어뜨릴 확률이 +30% 증가합니다."]
[1055,"G1_MaxShieldUpOnSkillGain",1,4,0,0,1,0,"Max",null,"Melee",101055,false,"일반 또는 고급 스킬을 얻으면 최대 보호막이 4 증가합니다."]
[1056,"G1_MaxHpUpOnLevelUp",1,4,0,0,1,0,"Max",null,"Melee",101056,false,"매 레벨 업 할 때마다 최대 생명력가 4 증가합니다."]
[1057,"G1_MaxShieldUpOnLevelUp",1,4,0,0,1,0,"Max",null,"Melee",101057,false,"매 레벨 업 할 때마다 최대 보호막이 4 증가합니다."]
[1058,"G1_HealOnBackKill",1,5,0,0,1,0,"Max",null,"Melee",101058,false,"후열의 적 처치 시 생명력을 5 회복합니다."]
[1059,"G1_DamageOnKill",1,2,0,0,1,0,"Max","Magic Door_Purple","Melee",101059,false,"적 처치 시 임의의 적에게 2 피해를 입힙니다."]
[1060,"G1_CastMagicMissilesOnBackKill",1,4,0,0,3,0.3,"Max","BlueCannonBullet","Range",101060,false,"후열의 적 처치 시 매직 미사일 3발을 시전해 무작위 적을 공격합니다."]
[1061,"G1_CastReaperOnLevelUp",1,1,0,0,1,0,"Max","DeathAttack","Melee",101061,false,"매 레벨 업 할 때마다 무작위 적 1명에게 사신의 낫을 시전해 즉사시킵니다."]
[1062,"G1_CastReaperOnNthCrit",1,10,0,0,1,0,"Max","DeathAttack","Melee",101062,false,"10번째 치명타 발생 시 피격 된 대상에게 사신의 낫을 시전해 즉사시킵니다."]
[1063,"G1_LevelUpOnCampFind",1,0,0,0,1,0,"Max",null,"Melee",101063,false,"캠프를 발견할 때마다 즉시 레벨 업합니다."]
[1064,"G1_StunAllEnemiesOnLevelUp",1,0,0,"6s",1,0,"Max",null,"Melee",101064,false,"레벨 업 시 모든 적을 6초 동안 기절시킵니다."]
[1065,"G1_CurseEnemiesOnLevelUp",1,1,0,0,1,0,"Max",null,"Melee",101065,false,"레벨 업 시 무작위 적 1명에게 저주 효과를 부여하고, 처치 시 시체 폭파를 일으킵니다."]
[1066,"G1_LootChestGivesHealAndXp",1,5,"5exp",0,1,0,"Max",null,"Melee",101066,false,"전리품 상자가 회복과 경험치를 제공합니다."]
[1067,"G1_CurseEnemiesOnBattlefield",1,2,0,0,1,0,"Max",null,"Melee",101067,false,"전장에 있는 적 2명에게 즉시 저주 효과를 부여하고, 처치 시 시체 폭파를 일으킵니다."]
[1068,"G1_MeleeEnemiesAttackSelfChance",1,0,0.2,0,1,0,"Max",null,"Melee",101068,true,"근접 적이 출몰할 때 20% 확률로 자신을 공격합니다."]
[1069,"G1_HolyDamageOnMeleeHit",1,2,0,0,1,0,"Max","Magic Door_Purple","Melee",101069,false,"근접 피해를 입힌 적에게 2의 신성 피해를 입힌다."]
[1070,"G1_DamageUpAfterMiss",1,0,4.25,0,3,0.3,"Max",null,"Melee",101070,true,"빗나감이 발생되면 다음 공격 피해를 425% 증가시킵니다."]
[2001,"G2_CriUpAfterCri",2,0,0.3,0,1,0,"Max","LevelUp3","Melee",102001,true,"치명타 발생 시 다음 치명타 확률이 +30% 증가 합니다."]
[2002,"G2_GetSkillOnCamp",2,0,0,0,1,0,"Max","FX_LevelUP","Melee",102002,false,"캠프를 방문할 때마다 무작위 일반 스킬을 얻습니다."]
[2003,"G2_ReduceMeeleEnemyDamage",2,2,0,0,1,0,"Max",null,"Melee",102003,false,"모든 근접 적의 피해가 2 감소합니다."]
[2004,"G2_ReduceRangeEnemyDamage",2,1,0,0,1,0,"Max",null,"Melee",102004,false,"모든 원거리 적의 피해가 1 감소합니다."]
[2005,"G2_ShieldRecoverOnLevelUp",2,10,0,0,1,0,"Max",null,"Melee",102005,false,"레벨 업 시 보호막이 10 회복됩니다."]
[2006,"G2_NegateMeleeDamageWithShield",2,0,0.4,0,1,0,"Max",null,"Melee",102006,true,"보호막은 근접 피해를 40% 확률로 무효화 합니다."]
[2007,"G2_NegateRangedAttackWithShield",2,0,0.5,0,1,0,"Max",null,"Melee",102007,true,"보호막이 있을 경우, 원거리 공격을 50% 확률로 무효화 합니다."]
[2008,"G2_ReduceRangedDamageWithShield",2,0,0.5,0,1,0,"Max",null,"Melee",102008,true,"보호막이 있을 경우, 원거리 피해를 50% 감소시킵니다."]
[2009,"G2_IncreaseDamageToBacklineEnemies",2,0,2.5,0,1,0,"Max",null,"Melee",102009,true,"후열에 있는 적에게 입히는 피해가 +250% 만큼 증가합니다."]
[2010,"G2_ActivateInvincibleShieldOnKill",2,0,0,"3s",1,0,"Max",null,"Melee",102010,false,"적 처시 시 모든 피해를 무효화하는 보호막을 3초 동안 활성화합니다."]
[3001,"G3_GetInstantGold",3,200,500,0,1,0,"Max",null,"Melee",103001,false,"지금 즉시 대량의 골드(200~500G)를 얻을 수 있습니다."]
[3002,"G3_IncreaseAttackSpeed",3,0,0.25,0,1,0,"Max","FX_LightPillar","Melee",103002,true,"공격 속도가 +25% 증가합니다."]
[3003,"G3_RangedHitNextAttackDamageUp",3,0,0.5,0,1,0,"Max",null,"Melee",103003,true,"원거리 피격 시 다음 공격으로 입히는 피해가 +50% 증가합니다."]
[3004,"G3_DodgeFirstRangedAttack",3,0,0,0,1,0,"Max",null,"Melee",103004,false,"원거리 적이 공격하는 첫 번째 공격을 무조건 회피합니다."]
[3005,"G3_IncreaseMeleeDodge",3,0,0.15,0,1,0,"Max",null,"Melee",103005,true,"근접 회피가 +15% 증가합니다."]
[3006,"G3_FirstAttackCritChanceUp",3,0,0.35,0,1,0,"Max",null,"Melee",103006,true,"첫 번째 공격은 치명타 확률이 35% 증가합니다."]
[3007,"G3_CritHitChainsToRandomEnemy",3,0,0.27,0,1,0,"Max","YellowSwordBeamHit","Melee",103007,true,"치명타가 발생할 경우, 27% 확률로 무작위 적에게도 동일한 피해를 입힙니다."]
[3008,"G3_HealHalfHPAndRefillPotions",3,0,0.5,0,1,0,"Max",null,"Melee",103008,true,"즉시 최대 생명력의 50%를 회복하고, 모든 물약을 가득 채웁니다."]
[3009,"G3_PotionUseDealsHealAsDamage",3,0,0,0,1,0,"Max","Holy hit","Melee",103009,false,"물약을 사용하면 모든 적에게 물약으로 회복 된 생명력과 동일한 피해를 입힙니다."]
[3010,"G3_MaxAttackUpEveryNDodges",3,1,6,0,1,0,"Max",null,"Melee",103010,false,"6번째 회피마다 최대 공격력이 1증가 합니다."]
[4001,"G4_ShieldedDamageReduction",4,0,0.5,0,1,0,"Max",null,"Melee",104001,true,"보호막이 있을 경우, 모든 받는 피해가 50% 감소됩니다."]
[4002,"G4_RangedAttackFrontEnemyDamageShare",4,0,0.5,0,1,0,"Max","MeeleAttack","Melee",104002,true,"원거리 적이 공격할 때 전열의 적이 있을 경우, 50%의 피해를 입힙니다."]
[4003,"G4_NHitFiresDarkMissiles",4,6,2,0,5,0.25,"Max","Magic Door_Purple","Range",104003,false,"6번째 일반 공격에 명중 된 적에게 암흑 미사일 5발을 연속 시전합니다."]
[4004,"G4_CritStunsAllEnemies",4,0,0,"3s",1,0,"Stun","Attack_Stun","Melee",104004,false,"치명타 발생 시 모든 적을 3초 동안 기절시킵니다."]
[4005,"G4_MaxAttackIncreasesByShield",4,0,0.5,0,1,0,"Max",null,"Melee",104005,true,"현재 보호막의 50%만큼 최대 공격력이 증가합니다."]
[4006,"G4_MaxAttackUpAndHealOnKill",4,10,1,0,1,0,"Max",null,"Melee",104006,false,"최대 공격력이 +10 증가하고, 적 처치 시 생명력을 추가로 1 회복합니다."]
[4007,"G4_NHitCastsLightning",4,4,2.5,0,1,0,"Max","FX_Cartoon Thunder","Melee",104007,false,"일반 공격을 4회 명중할 때마다 임의의 적에게 낙뢰를 시전합니다."]
[4008,"G4_NHitHealsByMaxHPPercent",4,5,0.1,0,1,0,"Heal_Hp_Mul",null,"Melee",104008,true,"5번째 일반 공격마다 최대 생명력의 10%만큼 회복합니다."]
[4009,"G4_NhMeleeHitRestoresShield",4,4,0.2,0,1,0,"Max",null,"Melee",104009,true,"근접 피해를 4회 받을 때마다 최대 보호막의 20%를 회복합니다."]
[4010,"G4_NHitCastsFireballAOE",4,6,5,0,1,0,"Max","FX_Fireball_Fall","Melee",104010,false,"6번째 일반 공격 명중 시 임의의 적에게 범위 피해를 입히는 화염구를 시전합니다."]
[5001,"G5_FirstAttackTripleDamage",5,3,0,0,1,0,"Max",null,"Melee",105001,false,"적에게 입히는 첫 번째 공격은 x3배의 피해를 입힙니다."]
[5002,"G5_RangedDamageRandomReflect",5,0,0,0,1,0,"Max",null,"Melee",105002,false,"모든 원거리 피해는 무작위 적에게 반사됩니다."]
[5003,"G5_ReviveOnDeath",5,0.4,0,0,1,0,"Max",null,"Melee",105003,true,"사망할 경우, 40% 확률로 부활합니다."]
[5004,"G5_AllRangedEnemiesBlindIfBackline",5,0,0,"10s",1,0,"Max",null,"Melee",105004,false,"모든 원거리 적은 후열에 있을 경우 눈멀기 상태가 됩니다."]
[5005,"G5_CastFireballOnCrit",5,0,1,0,1,0,"Max","FX_Fireball_Fall","Melee",105005,false,"치명타에 명중 된 대상에게 범위 피해를 입히는 화염구를 추가로 시전합니다."]
[5006,"G5_ShieldHealWhenHealed",5,0,0,0,1,0,"Max",null,"Melee",105006,false,"회복 효과가 발생 될 때마다 보호막도 회복됩니다."]
[5007,"G5_ArcaneExplosionOnKill",5,0,1,0,1,0,"Max","FX_Icelight_Seal","Melee",105007,false,"적 처치 시 모든 적에게 신비한 폭발 피해를 입힙니다."]
[5008,"G5_FlatDamageMinMaxEqual",5,0,0,0,1,0,"Max",null,"Melee",105008,false,"최소 공격력과 최대 공격력이 항상 동일하게 적용됩니다."]
[5009,"G5_StunBacklineOnKill",5,0,0,"4s",1,0,"Max",null,"Melee",105009,false,"적 처치 시 후열의 적이 4초 동안 기절합니다."]
[5010,"G5_ReflectAllDamageWhenShielded",5,0,0,0,1,0,"Max",null,"Melee",105010,false,"보호막이 활성화 되어있을 경우, 받는 모든 피해를 반사합니다."]

{"sheet":"PCList","index":20,"n_rows":7,"n_cols":28,"rows_kept":7,"cut":false,"hidden":false,"merged":[]}
["n_ID","s_Image","s_Element","s_SlotElement","f_AttackCoolTime","n_AttackMin","n_AttackMax","f_Cri","f_CriDmg","n_HP","n_Shield","n_Avoid_Meele","n_Avoid_Range","e_AttackType","s_Projectile","n_Specificity1","n_Specificity1_Effect","n_Specificity1_Target","n_Specificity2","n_Specificity2_Effect","n_Specificity2_Target","n_Specificity3","n_Specificity3_Effect","n_Specificity3_Target","n_Specificity4","n_Specificity4_Effect","n_Specificity4_Target"]
["PC ID","PC 이미지","캐릭터 속성 (3개 고정)","슬롯 6개 착용 가능한 속성","공격 쿨타임","최소 공격력","최대 공격력","치명타 확률","치명타 피해량","체력","보호막","회피력(근)","회피력(원)","기본 공격 이펙트","기본 공격 투사체","영웅 특성1","특성1 효과","특성1 대상","영웅 특성1","특성2 효과","특성2 대상","영웅 특성3","특성3 효과","특성3 대상","영웅 특성4","특성4 효과","특성4 대상"]
[6001,"pc1","Fire^Water^Wind","Fire^Water^Wind^Fire^Water^Wind",1.2,1,2,5,150,999,999,10,10,"Melee","MeleeAttack",10101,1010001,1020001,10102,1010003,1020005,10103,1010002,1020003,10104,1010003,1020006,"루시"]
[6002,"pc2","Light^Earth^Dark","Light^Earth^Dark^Light^Earth^Dark",3,1,3,5,150,10,0,10,10,"Range","BlueCannonBullet",10201,1010002,1020002,10202,1010002,1020004,10203,1010002,1020004,10204,1010003,1020004,"루나"]
[6003,"pc3","Wind^Light^Earth","Wind^Light^Earth^Wind^Light^Earth",1.2,1,2,5,150,999,999,10,10,"Melee","MeleeAttack",10101,1010003,1020003,10102,1010001,1020003,10103,1010002,1020003,10104,1010003,1020003]
[6004,"pc4","Fire^Water^Earth","Fire^Water^Earth^Fire^Water^Earth",1.2,1,2,5,150,999,999,10,10,"Melee","MeleeAttack",10101,1010001,1020004,10102,1010001,1020002,10103,1010002,1020002,10104,1010003,1020002]
[6005,"pc5","Fire^Earth^Dark","Fire^Earth^Dark^Fire^Earth^Dark",3,1,3,5,150,10,0,10,10,"Range","BlueCannonBullet",10201,1010002,1020005,10202,1010002,1020001,10203,1010002,1020001,10204,1010003,1020005]

{"sheet":"SealList","index":21,"n_rows":62,"n_cols":15,"rows_kept":62,"cut":false,"hidden":false,"merged":[]}
["n_ID","e_SealType","e_Element","n_Star","e_SpecialEffect1","s_Value1","s_Projectile1","b_PercentValue1","e_SpecialEffect2","s_Value2","s_Projectile2","b_PercentValue2","n_Desc1","n_Desc2","exception"]
["인장 ID","인장 타입","속성","스텝","특수 효과 정의1","값1","적용할 투사체","%값인 지 여부","특수 효과 정의2","값2","적용할 투사체","%값인 지 여부","특수효과 설명1","특수효과 설명2","참고용 텍스트"]
[20101,"Magic","Dark",1,"MagicMissileDamage",1,"BlueCannonBullet",false,"DarkMissileDamage",0.03,"Magic Door_Purple",true,900101,900102,"매직 미사일 / 암흑 미사일 피해 증가"]
[20101,"Magic","Dark",2,"MagicMissileDamage",2,"BlueCannonBullet",false,"DarkMissileDamage",0.05,"Magic Door_Purple",true,900101,900102]
[20101,"Magic","Dark",3,"MagicMissileDamage",3,"BlueCannonBullet",false,"DarkMissileDamage",0.08,"Magic Door_Purple",true,900101,900102]
[20101,"Magic","Dark",4,"MagicMissileDamage",5,"BlueCannonBullet",false,"DarkMissileDamage",0.12,"Magic Door_Purple",true,900101,900102]
[20101,"Magic","Dark",5,"MagicMissileDamage",8,"BlueCannonBullet",false,"DarkMissileDamage",0.2,"Magic Door_Purple",true,900101,900102]
[20102,"Reaper","Dark",1,"CorpseExplosion",1,null,false,"LifeSteal",0.03,null,true,900201,900202,"시체 폭파 / 흡혈 피해"]
[20102,"Reaper","Dark",2,"CorpseExplosion",2,null,false,"LifeSteal",0.05,null,true,900201,900202]
[20102,"Reaper","Dark",3,"CorpseExplosion",3,null,false,"LifeSteal",0.08,null,true,900201,900202]
[20102,"Reaper","Dark",4,"CorpseExplosion",5,null,false,"LifeSteal",0.12,null,true,900201,900202]
[20102,"Reaper","Dark",5,"CorpseExplosion",8,null,false,"LifeSteal",0.2,null,true,900201,900202]
[20103,"Lightning","Water",1,"ElectricShock",1,"FX_Cartoon Thunder",false,"Thunder",0.03,"FX_Cartoon Thunder",true,900301,900302,"전기 충격 / 낙뢰"]
[20103,"Lightning","Water",2,"ElectricShock",2,"FX_Cartoon Thunder",false,"Thunder",0.05,"FX_Cartoon Thunder",true,900301,900302,"※ 둘 중 하나 투사체 변경 필요"]
[20103,"Lightning","Water",3,"ElectricShock",3,"FX_Cartoon Thunder",false,"Thunder",0.08,"FX_Cartoon Thunder",true,900301,900302]
[20103,"Lightning","Water",4,"ElectricShock",5,"FX_Cartoon Thunder",false,"Thunder",0.12,"FX_Cartoon Thunder",true,900301,900302]
[20103,"Lightning","Water",5,"ElectricShock",8,"FX_Cartoon Thunder",false,"Thunder",0.2,"FX_Cartoon Thunder",true,900301,900302]
[20104,"Flame","Fire",1,"Meteor",0.1,null,true,"Fireball",0.05,"FX_Fireball_Fall",true,900401,900402,"운석 / 화염구"]
[20104,"Flame","Fire",2,"Meteor",0.2,null,true,"Fireball",0.1,"FX_Fireball_Fall",true,900401,900402]
[20104,"Flame","Fire",3,"Meteor",0.3,null,true,"Fireball",0.16,"FX_Fireball_Fall",true,900401,900402]
[20104,"Flame","Fire",4,"Meteor",0.4,null,true,"Fireball",0.24,"FX_Fireball_Fall",true,900401,900402]
[20104,"Flame","Fire",5,"Meteor",0.5,null,true,"Fireball",0.35,"FX_Fireball_Fall",true,900401,900402]
[20105,"Holy","Light",1,"HolyDamage",1,"Magic Door_Purple",false,"ShieldBonus",0.05,null,true,900501,900502,"신성 피해 / 보호막 증가"]
[20105,"Holy","Light",2,"HolyDamage",2,"Magic Door_Purple",false,"ShieldBonus",0.1,null,true,900501,900502,"※ 투사체 변경 필요"]
[20105,"Holy","Light",3,"HolyDamage",3,"Magic Door_Purple",false,"ShieldBonus",0.15,null,true,900501,900502]
[20105,"Holy","Light",4,"HolyDamage",4,"Magic Door_Purple",false,"ShieldBonus",0.2,null,true,900501,900502]
[20105,"Holy","Light",5,"HolyDamage",5,"Magic Door_Purple",false,"ShieldBonus",0.25,null,true,900501,900502]
[20106,"Blade","Earth",1,"RockBlade",0.05,null,true,"ArrowRain",0.05,null,true,900601,900602,"칼날 바위 / 화살의 비"]
[20106,"Blade","Earth",2,"RockBlade",0.1,null,true,"ArrowRain",0.1,null,true,900601,900602]
[20106,"Blade","Earth",3,"RockBlade",0.16,null,true,"ArrowRain",0.16,null,true,900601,900602]
[20106,"Blade","Earth",4,"RockBlade",0.24,null,true,"ArrowRain",0.24,null,true,900601,900602]
[20106,"Blade","Earth",5,"RockBlade",0.35,null,true,"ArrowRain",0.35,null,true,900601,900602]
[20107,"Pierce","Wind",1,"DoomRay",0.1,null,true,"PiercingLightning",0.05,null,true,900701,900702,"파멸의 광선 / 관통 번개 "]
[20107,"Pierce","Wind",2,"DoomRay",0.2,null,true,"PiercingLightning",0.1,null,true,900701,900702]
[20107,"Pierce","Wind",3,"DoomRay",0.3,null,true,"PiercingLightning",0.16,null,true,900701,900702]
[20107,"Pierce","Wind",4,"DoomRay",0.4,null,true,"PiercingLightning",0.24,null,true,900701,900702]
[20107,"Pierce","Wind",5,"DoomRay",0.5,null,true,"PiercingLightning",0.35,null,true,900701,900702]
[20108,"AoE","Water",1,"Blizzard",0.1,null,true,"MysticExplosion",0.05,"FX_Icelight_Seal",true,900801,900802,"혹한의 눈보라 / 신비한 폭발"]
[20108,"AoE","Water",2,"Blizzard",0.2,null,true,"MysticExplosion",0.1,"FX_Icelight_Seal",true,900801,900802,"※ 신비한 폭발 투사체 변경 필요"]
[20108,"AoE","Water",3,"Blizzard",0.3,null,true,"MysticExplosion",0.16,"FX_Icelight_Seal",true,900801,900802]
[20108,"AoE","Water",4,"Blizzard",0.4,null,true,"MysticExplosion",0.24,"FX_Icelight_Seal",true,900801,900802]
[20108,"AoE","Water",5,"Blizzard",0.5,null,true,"MysticExplosion",0.35,"FX_Icelight_Seal",true,900801,900802]
[20109,"Heal","Light",1,"HealBonus",1,null,false,"MaxLife",0.03,null,true,900901,900902,"회복 효과 / 생명력"]
[20109,"Heal","Light",2,"HealBonus",2,null,false,"MaxLife",0.05,null,true,900901,900902]
[20109,"Heal","Light",3,"HealBonus",3,null,false,"MaxLife",0.08,null,true,900901,900902]
[20109,"Heal","Light",4,"HealBonus",4,null,false,"MaxLife",0.12,null,true,900901,900902]
[20109,"Heal","Light",5,"HealBonus",5,null,false,"MaxLife",0.2,null,true,900901,900902]
[20110,"Haste","Wind",1,"AttackSpeed",0.01,null,true,"PhantomSpear",0.05,"FX_BlueCharge",true,901001,901002,"공속 증가 / 환영의 창"]
[20110,"Haste","Wind",2,"AttackSpeed",0.02,null,true,"PhantomSpear",0.1,"FX_BlueCharge",true,901001,901002]
[20110,"Haste","Wind",3,"AttackSpeed",0.04,null,true,"PhantomSpear",0.16,"FX_BlueCharge",true,901001,901002]
[20110,"Haste","Wind",4,"AttackSpeed",6.5000000000000002E-2,null,true,"PhantomSpear",0.24,"FX_BlueCharge",true,901001,901002]
[20110,"Haste","Wind",5,"AttackSpeed",0.1,null,true,"PhantomSpear",0.35,"FX_BlueCharge",true,901001,901002]
[20111,"Critical","Fire",1,"CritChance",2E-3,null,true,"CritDamage",0.03,null,true,901101,901102,"치명타 / 치명 피해"]
[20111,"Critical","Fire",2,"CritChance",4.0000000000000001E-3,null,true,"CritDamage",0.05,null,true,901101,901102]
[20111,"Critical","Fire",3,"CritChance",6.0000000000000001E-3,null,true,"CritDamage",0.08,null,true,901101,901102]
[20111,"Critical","Fire",4,"CritChance",8.0000000000000002E-3,null,true,"CritDamage",0.12,null,true,901101,901102]
[20111,"Critical","Fire",5,"CritChance",0.01,null,true,"CritDamage",0.2,null,true,901101,901102]
[20112,"Sacrifice","Earth",1,"GoldGain",0.01,null,true,"ExpGain",0.01,null,true,901201,901202,"골드 및 경험치 획득량 증가"]
[20112,"Sacrifice","Earth",2,"GoldGain",0.02,null,true,"ExpGain",0.02,null,true,901201,901202]
[20112,"Sacrifice","Earth",3,"GoldGain",0.04,null,true,"ExpGain",0.04,null,true,901201,901202]
[20112,"Sacrifice","Earth",4,"GoldGain",6.5000000000000002E-2,null,true,"ExpGain",6.5000000000000002E-2,null,true,901201,901202]
[20112,"Sacrifice","Earth",5,"GoldGain",0.1,null,true,"ExpGain",0.1,null,true,901201,901202]

{"sheet":"BuffPatternConfig","index":22,"n_rows":22,"n_cols":8,"rows_kept":22,"cut":false,"hidden":false,"merged":[]}
["s_BuffType","b_MaintainBuff","n_AppearRate","n_BuffDesc","n_BuffOptionID"]
["_맵툴 버프 표기 문구","효과 유지 여부","버프 발생 비중","버프 효과 발생 등장 문구","버프 효과 ID",null,"비고","효과 설명"]
["생명력 회복",false,100,30001,21001,null,"즉시 발동","생명력 회복"]
["실드 회복",false,100,30002,21002,null,"즉시 발동","실드 회복"]
["중독",false,100,30003,21003,null,"즉시 발동","중독 효과 발생"]
["전투 발생",false,100,30004,21004,null,"즉시 발동","전투 발생"]
["최대 생명력 증가",true,100,30005,21005,null,"전투 종료 시까지","최대 생명력 증가"]
["최대 생명력 감소",true,100,30006,21006,null,"전투 종료 시까지","최대 생명력 감소"]
["최대 실드 증가",true,100,30007,21007,null,"전투 종료 시까지","최대 실드 증가"]
["최대 실드 감소",true,100,30008,21008,null,"전투 종료 시까지","최대 실드 감소"]
["공격력 증가",true,50,30009,21009,null,"전투 종료 시까지","공격력 증가"]
["공격력 감소",true,50,30010,21010,null,"전투 종료 시까지","공격력 감소"]
["회피율 증가",true,100,30011,21011,null,"전투 종료 시까지","회피율 증가"]
["회피율 감소",true,100,30012,21012,null,"전투 종료 시까지","회피율 감소"]
["명중력 증가",true,100,30013,21013,null,"전투 종료 시까지","명중 증가"]
["명중력 감소",true,100,30014,21014,null,"전투 종료 시까지","명중력 감소"]
["치명타 확률 증가",true,100,30015,21015,null,"전투 종료 시까지","치명타 확률 증가"]
["치명타 확률 감소",true,100,30016,21016,null,"전투 종료 시까지","치명타 확률 감소"]
["치명타 피해량 증가",true,100,30017,21017,null,"전투 종료 시까지","치명타 피해량 증가"]
["치명타 피해량 감소",true,100,30018,21018,null,"전투 종료 시까지","치명타 피해량 감소"]
["공격 속도 증가",true,100,30019,21019,null,"전투 종료 시까지","공격 속도 증가"]
["공격 속도 감소",true,100,30020,21020,null,"전투 종료 시까지","공격 속도 감소"]

{"sheet":"PCAwakening","index":23,"n_rows":17,"n_cols":19,"rows_kept":17,"cut":false,"hidden":false,"merged":[]}
["n_PCID","n_ID","n_Step","e_Position","n_NextID1","n_NextID2","n_NextID3","s_Icon","n_Name","n_Desc","e_Stat1","s_Value1","s_UpgradeStatValuePara1","e_Stat2","s_Value2","s_UpgradeStatValuePara2","n_MaxLv","n_NeedSoul","exception"]
["PC ID","특성 고유 ID","특성 강화 단계","포지션(좌중우)","다음 특성 ID1","다음 특성 ID2","다음 특성 ID3","특성 아이콘","특성 이름","특설 설명","스탯1","특성값1","레벨당 증가값1","스탯2","특성값2","레벨당 증가값2","최대 강화 레벨","레벨 업시 필요한 소울","설명"]
[6001,10100011,1,"Center",0,{"$f":"B5","v":10100022},0,{"$f":"\"awaken_\"&B3","v":"awaken_10100011"},810011,810111,"Attack_Min",0,1,"None",0,0,5,15,"최소 공격력 증가"]
[6001,10100021,2,"Left",0,0,0,{"$f":"\"awaken_\"&B4","v":"awaken_10100021"},810021,810121,"Attack_Max",0,1,"None",0,0,5,20,"최대 공격력 증가"]
[6001,10100022,2,"Center",0,0,0,"awaken_10100022",810022,810122,"MaxHP",0,2,"None",0,0,5,20,"최대 생명력 증가"]
[6002,10200011,1,"Center",{"$f":"B7","v":10200021},0,{"$f":"B8","v":10200022},"awaken_10200011",820011,820111,"MaxPotion",0,1,"None",0,0,5,15,"최대 포션 소지수 증가"]
[6002,10200021,2,"Left",0,0,0,"awaken_10200021",820021,820121,"Avoid_Melee",0,0.01,"None",0,0,5,20,"근거리 회피율 증가"]
[6002,10200022,2,"Right",0,0,0,"awaken_10200022",820022,820122,"Avoid_Range",0,0.01,"None",0,0,5,20,"원거리 회피율 증가"]
[6003,10300011,1,"Center",{"$f":"B10","v":10300021},0,{"$f":"B11","v":10300022},"awaken_10300011",820011,820111,"MaxPotion",0,1,"None",0,0,5,15,"최대 포션 소지수 증가"]
[6003,10300021,2,"Left",0,0,0,"awaken_10300021",820021,820121,"Avoid_Melee",0,0.01,"None",0,0,5,20,"근거리 회피율 증가"]
[6003,10300022,2,"Right",0,0,0,"awaken_10300022",820022,820122,"Avoid_Range",0,0.01,"None",0,0,5,20,"원거리 회피율 증가"]
[6004,10400011,1,"Center",0,{"$f":"B14","v":10400022},0,{"$f":"\"awaken_\"&B12","v":"awaken_10400011"},810011,810111,"Attack_Min",0,1,"None",0,0,5,15,"최소 공격력 증가"]
[6004,10400021,2,"Left",0,0,0,{"$f":"\"awaken_\"&B13","v":"awaken_10400021"},810021,810121,"Attack_Max",0,1,"None",0,0,5,20,"최대 공격력 증가"]
[6004,10400022,2,"Center",0,0,0,"awaken_10400022",810022,810122,"MaxHP",0,2,"None",0,0,5,20,"최대 생명력 증가"]
[6005,10500011,1,"Center",{"$f":"B16","v":10500021},0,{"$f":"B17","v":10500022},"awaken_10500011",820011,820111,"MaxPotion",0,1,"None",0,0,5,15,"최대 포션 소지수 증가"]
[6005,10500021,2,"Left",0,0,0,"awaken_10500021",820021,820121,"Avoid_Melee",0,0.01,"None",0,0,5,20,"근거리 회피율 증가"]
[6005,10500022,2,"Right",0,0,0,"awaken_10500022",820022,820122,"Avoid_Range",0,0.01,"None",0,0,5,20,"원거리 회피율 증가"]

{"sheet":"PCEvolution","index":24,"n_rows":32,"n_cols":10,"rows_kept":32,"cut":false,"hidden":false,"merged":[]}
["n_PCID","n_Star","e_Stat1","n_AttackValue","e_Stat2","n_MaxHPValue","e_Stat3","n_MaxShieldValue","e_Stat4","n_HitRateValue"]
["_PC ID","진화 스텝","진화 스탯 1","공격력","진화 스탯 2","최대 생명력","진화 스탯 3","최대 보호막","진화 스탯 4","명중률"]
[6001,1,"Attack",1,"MaxHP",5,"MaxShield",5,"HitRate",5]
[6001,2,"Attack",2,"MaxHP",10,"MaxShield",10,"HitRate",10]
[6001,3,"Attack",3,"MaxHP",15,"MaxShield",15,"HitRate",15]
[6001,4,"Attack",4,"MaxHP",20,"MaxShield",20,"HitRate",20]
[6001,5,"Attack",5,"MaxHP",25,"MaxShield",25,"HitRate",25]
[6001,6,"Attack",6,"MaxHP",30,"MaxShield",30,"HitRate",30]
[6002,1,"Attack",2,"MaxHP",5,"MaxShield",5,"HitRate",5]
[6002,2,"Attack",3,"MaxHP",10,"MaxShield",10,"HitRate",10]
[6002,3,"Attack",4,"MaxHP",15,"MaxShield",15,"HitRate",15]
[6002,4,"Attack",5,"MaxHP",20,"MaxShield",20,"HitRate",20]
[6002,5,"Attack",6,"MaxHP",25,"MaxShield",25,"HitRate",25]
[6002,6,"Attack",7,"MaxHP",30,"MaxShield",30,"HitRate",30]
[6003,1,"Attack",3,"MaxHP",5,"MaxShield",5,"HitRate",5]
[6003,2,"Attack",4,"MaxHP",10,"MaxShield",10,"HitRate",10]
[6003,3,"Attack",5,"MaxHP",15,"MaxShield",15,"HitRate",15]
[6003,4,"Attack",6,"MaxHP",20,"MaxShield",20,"HitRate",20]
[6003,5,"Attack",7,"MaxHP",25,"MaxShield",25,"HitRate",25]
[6003,6,"Attack",8,"MaxHP",30,"MaxShield",30,"HitRate",30]
[6004,1,"Attack",4,"MaxHP",5,"MaxShield",5,"HitRate",5]
[6004,2,"Attack",5,"MaxHP",10,"MaxShield",10,"HitRate",10]
[6004,3,"Attack",6,"MaxHP",15,"MaxShield",15,"HitRate",15]
[6004,4,"Attack",7,"MaxHP",20,"MaxShield",20,"HitRate",20]
[6004,5,"Attack",8,"MaxHP",25,"MaxShield",25,"HitRate",25]
[6004,6,"Attack",9,"MaxHP",30,"MaxShield",30,"HitRate",30]
[6005,1,"Attack",5,"MaxHP",5,"MaxShield",5,"HitRate",5]
[6005,2,"Attack",6,"MaxHP",10,"MaxShield",10,"HitRate",10]
[6005,3,"Attack",7,"MaxHP",15,"MaxShield",15,"HitRate",15]
[6005,4,"Attack",8,"MaxHP",20,"MaxShield",20,"HitRate",20]
[6005,5,"Attack",9,"MaxHP",25,"MaxShield",25,"HitRate",25]
[6005,6,"Attack",10,"MaxHP",30,"MaxShield",30,"HitRate",30]

{"sheet":"PCEvolutionMax","index":25,"n_rows":11,"n_cols":3,"rows_kept":11,"cut":false,"hidden":false,"merged":[]}
["e_Stat","s_Value","s_Rate"]
["_한계돌파 스탯","스탯값","발생 확률"]
["Attack_Min",1,0.03]
["Attack_Max",1,0.06]
["MaxHP",1,0.35]
["MaxShield",1,0.25]
["HitRate",1,0.03]
["Avoid_Melee","0.1%",0.05]
["Avoid_Range","0.1%",0.05]
["Cri","0.1%",0.03]
["CriDmg","1%",0.15]

{"sheet":"StatusOptionSet","index":26,"n_rows":316,"n_cols":21,"rows_kept":316,"cut":false,"hidden":false,"merged":[]}
["n_StatusID","s_Icon","e_StatusConditionsType","s_SkillTarget","e_ActiveConditions","s_ActiveConditionsValue","b_DotDmg","e_BuffType","e_Stat1","e_Stat2","s_DefaultStatValuePara1","s_DefaultStatValuePara2","s_UpgradeStatValuePara1","s_UpgradeStatValuePara2"]
["_능력치 고유 키값","아이콘","사용할 효과 타입","Status 효과 적용 대상","발생 조건","발생 조건 값","도트 데미지","버프 타입","스탯1","스탯2","기본 스텟 능력치 파라메터1","기본 스텟 능력치 파라메터2","강화 시 증가 능력치 파라메터1","강화 시 증가 능력치 파라메터2",null,null,null,"발생 조건","Value 값","상세 설명"]
[10101,"spe_01_00","PC_DefaultAttack_Add","Self","None",1,false,"Buff","Attack_Min","Attack_Max","1","1","1","2",{"$f":"VLOOKUP(C3,StatusConditionsList!$A$3:$J$71,10,FALSE)","v":"영웅 기본 공격력에 최소 / 최대 공격력 고정(+) 수치 추가"},null,null,"None","0 (사용 안함)","항상 적용되는 패시브 효과 개념"]
[10102,"spe_01_01","PC_Evasion_All","Self","Hit_PreemptiveStrike",1,false,"Buff","AvoidAll_1Time","None","10%","10%","5%","5%",{"$f":"VLOOKUP(C4,StatusConditionsList!$A$3:$J$71,10,FALSE)","v":"영웅 근접 / 원거리 회피 확률에 고정(+) 확률을 각각 추가"},null,null,"Attack_Normal","발생 확률","기본 공격 시 {Value}% 확률로 발동",1]
[10103,"spe_01_02","HitCriticalRate_Add","Self","Hit_Noraml",1,false,"Buff","AddCri_Once","None","1%",0,0,0,{"$f":"VLOOKUP(C5,StatusConditionsList!$A$3:$J$71,10,FALSE)","v":"공격 명중 시마다 영웅 기본 치명타 피해량에 고정(+) 확률 값을 추가(치명타 발생 시 초기화)"},null,null,"Attack_Hit","발생 확률","기본 공격 명중 시 {Value}% 확률로 발동",1]
[10104,"spe_01_03","PC_CriticalRate_Add","Self","Attack_Critical",1,false,"Buff","CriDmg","None",0.5,"0","25%",0,{"$f":"VLOOKUP(C6,StatusConditionsList!$A$3:$J$71,10,FALSE)","v":"치명타 피해량 증가"},null,null,"Attack_Critical","발생 확률","치명타 공격 시 {Value}% 확률로 발동",1]
[10201,"spe_03_00","PC_DefaultAttack_Add","Self","None",1,false,"Buff","Attack_Min","Attack_Max","1","1","1","2",{"$f":"VLOOKUP(C7,StatusConditionsList!$A$3:$J$71,10,FALSE)","v":"영웅 기본 공격력에 최소 / 최대 공격력 고정(+) 수치 추가"},null,null,"Attack_Special","발생 확률","기본 공격 외 특수 효과 발동 시 {Value}% 확률로 발동",1]
[10202,"spe_03_02","Poison","Self","None",1,true,"Debuff","None","None",4,5,0,0,{"$f":"VLOOKUP(C8,StatusConditionsList!$A$3:$J$71,10,FALSE)","v":"중독"},null,null,"Hit_Noraml","발생 확률","피격 시 {Value}% 확률로 발동",1]
[10203,"spe_04_00","Poison","Self","None",1,true,"Debuff","None","None",4,5,0,0,{"$f":"VLOOKUP(C9,StatusConditionsList!$A$3:$J$71,10,FALSE)","v":"중독"},null,null,"Hit_Count","피격 횟수","해당 피격 {Value} 횟수 충족 시 발동"]
[10204,"spe_04_01","Poison","Self","None",1,true,"Debuff","None","None",4,5,0,0,{"$f":"VLOOKUP(C10,StatusConditionsList!$A$3:$J$71,10,FALSE)","v":"중독"},null,null,"Hit_PreemptiveStrike","발생 확률","선제 공격받는 상황에 {Value}% 확률로 발동",1]
[10301,"spe_04_02","Poison","Self","None",1,true,"Debuff","None","None",4,5,0,0,{"$f":"VLOOKUP(C11,StatusConditionsList!$A$3:$J$71,10,FALSE)","v":"중독"},null,null,"ActiveSkill","쿨타임","{Value} 초 쿨타임마다 액티브 스킬처럼 발동"]
[10302,"spe_04_03","Poison","Self","None",1,true,"Debuff","None","None",4,5,0,0,{"$f":"VLOOKUP(C12,StatusConditionsList!$A$3:$J$71,10,FALSE)","v":"중독"},null,null,"MaxHp_Up","남은 생명력","{Value} 값 상태 이상일 때 적용됨을 의미 (예: HP 5 이상일 때)"]
[10303,"spe_05_00","Poison","Self","None",1,true,"Debuff","None","None",4,5,0,0,{"$f":"VLOOKUP(C13,StatusConditionsList!$A$3:$J$71,10,FALSE)","v":"중독"},null,null,"MaxHp_Down","남은 생명력","{Value} 값 상태 이하일 때 적용됨을 의미 (예: HP 5 이하일 때)"]
[10304,"spe_05_01","Poison","Self","None",1,true,"Debuff","None","None",4,5,0,0,{"$f":"VLOOKUP(C14,StatusConditionsList!$A$3:$J$71,10,FALSE)","v":"중독"},null,null,"MaxHpRate","남은 비율","{Value} = 100은 생명력 최대 100%, {Value} = 0은 0%죽음을 의미",1]
[10401,"spe_05_02","Poison","Self","None",1,true,"Debuff","None","None",4,5,0,0,{"$f":"VLOOKUP(C15,StatusConditionsList!$A$3:$J$71,10,FALSE)","v":"중독"},null,null,"MaxShield_Up","남은 실드량","{Value} 값 상태 이상일 때 적용됨을 의미"]
[10402,"spe_01_00","Poison","Self","None",1,true,"Debuff","None","None",4,5,0,0,{"$f":"VLOOKUP(C16,StatusConditionsList!$A$3:$J$71,10,FALSE)","v":"중독"},null,null,"MaxShield_Down","남은 실드량","{Value} 값 상태 이하일 때 적용됨을 의미"]
[10403,"spe_01_01","Poison","Self","None",1,true,"Debuff","None","None",4,5,0,0,{"$f":"VLOOKUP(C17,StatusConditionsList!$A$3:$J$71,10,FALSE)","v":"중독"},null,null,"MaxShield_Rate","남은 비율","{Value} = 100은 실드 최대 100%, {Value} = 0은 0% 실드 소멸을 의미",1]
[10404,"spe_01_02","Poison","Self","None",1,true,"Debuff","None","None",4,5,0,0,{"$f":"VLOOKUP(C18,StatusConditionsList!$A$3:$J$71,10,FALSE)","v":"중독"},null,null,"Appear","0 (사용 안함)","몬스터가 전투에 참여한 시점부터 발동 (전열 또는 후열)"]
[10501,"spe_01_03","Poison","Self","None",1,true,"Debuff","None","None",4,5,0,0,{"$f":"VLOOKUP(C19,StatusConditionsList!$A$3:$J$71,10,FALSE)","v":"중독"},null,null,"SurviveAlone","0 (사용 안함)","몬스터가 전장에 혼자만 살아있는 상태일 때 발동"]
[10502,"spe_03_00","Poison","Self","None",1,true,"Debuff","None","None",4,5,0,0,{"$f":"VLOOKUP(C20,StatusConditionsList!$A$3:$J$71,10,FALSE)","v":"중독"},null,null,"Die_Self","0 (사용 안함)","자신이 죽었을 때 발생"]
[10503,"spe_03_02","Poison","Self","None",1,true,"Debuff","None","None",4,5,0,0,{"$f":"VLOOKUP(C21,StatusConditionsList!$A$3:$J$71,10,FALSE)","v":"중독"},null,null,"Die_Front","0 (사용 안함)","전열의 임의의 적이 죽었을 때 발생"]
[10504,"spe_04_00","Poison","Self","None",1,true,"Debuff","None","None",4,5,0,0,{"$f":"VLOOKUP(C22,StatusConditionsList!$A$3:$J$71,10,FALSE)","v":"중독"},null,null,"Die_Back","0 (사용 안함)","후열의 임의의 적이 죽었을 때 발생"]
[21001,"spe_04_01","Heal_Hp_Random","Self","Instantly",1,false,"None","None","None","1","10","0",0,{"$f":"VLOOKUP(C23,StatusConditionsList!$A$3:$J$71,10,FALSE)","v":"HP 회복 : 고정 랜덤(+)"},null,null,"Die_Ally","0 (사용 안함)","임의의 아군이 죽었을 때 발생"]
[21002,"spe_04_02","Heal_Shield_Random","Self","Instantly",1,false,"None","None","None","1","10","0",0,{"$f":"VLOOKUP(C24,StatusConditionsList!$A$3:$J$71,10,FALSE)","v":"실드 회복 : 고정 랜덤(+)"},null,null,"Evasion_Count","회피 횟수","회피 발생 횟수가 {Value}일 때마다 발동"]
[21003,"spe_04_03","Poison","Self","Instantly",1,true,"Debuff","None","None","10s","1",0,0,{"$f":"VLOOKUP(C25,StatusConditionsList!$A$3:$J$71,10,FALSE)","v":"중독"},null,null,"Evasion_Rate","발생 확률","회피 성공 시 {Value}% 확률로 발동",1]
[21004,"spe_05_00","Battle","None","Instantly",1,false,"None","None","None","1","10","0",0,{"$f":"VLOOKUP(C26,StatusConditionsList!$A$3:$J$71,10,FALSE)","v":"즉시 지정 된 몬스터 등장 후 전투 발생(선제 공격)"},null,null,"Miss_Count","빗나감 횟수","빗나감 발생 횟수가 {Value}일 때마다 발동"]
[21005,"spe_05_01","PC_IncreaseMaxHp_Mul","Self","Instantly",1,false,"Buff","MaxHP_Mul","None",0.1,"0","0","0",{"$f":"VLOOKUP(C27,StatusConditionsList!$A$3:$J$71,10,FALSE)","v":"영웅의 최대 생명력을 기준으로 비율(%) 만큼 최대 생명력 증가"},null,null,"Miss_Rate","빗나감 확률","빗나감 발생 시 {Value}% 확률로 발동",1]
[21006,"spe_05_02","PC_IncreaseMaxHp_Mul","Self","Instantly",1,false,"Debuff","MaxHP_Mul","None",-0.1,"0","0","0",{"$f":"VLOOKUP(C28,StatusConditionsList!$A$3:$J$71,10,FALSE)","v":"영웅의 최대 생명력을 기준으로 비율(%) 만큼 최대 생명력 증가"},null,null,"Potion_Use","발생 확률","포션 사용 시 {Value}% 확률로 발동",1]
[21007,"spe_01_00","PC_IncreaseMaxShield_Mul","Self","Instantly",1,false,"Buff","MaxShield_Mul","None",0.1,"0","0","0",{"$f":"VLOOKUP(C29,StatusConditionsList!$A$3:$J$71,10,FALSE)","v":"영웅의 최대 보호막을 기준으로 비율(%) 만큼 최대 보호막 증가"},null,null,"Potion_Count","사용 횟수","포션 사용 {Value} 횟수 충족 시 발동"]
[21008,"spe_01_01","PC_IncreaseMaxShield_Mul","Self","Instantly",1,false,"Debuff","MaxShield_Mul","None",-0.1,"0","0","0",{"$f":"VLOOKUP(C30,StatusConditionsList!$A$3:$J$71,10,FALSE)","v":"영웅의 최대 보호막을 기준으로 비율(%) 만큼 최대 보호막 증가"},null,null,"Sancturay","0 (사용 안함)","성소 효과 발동","2025.11.16 정인호 추가"]
[21009,"spe_01_02","ATK_DMG_Mul","Self","Instantly",1,false,"Buff","DmgMul","None",0.1,"0","0","0",{"$f":"VLOOKUP(C31,StatusConditionsList!$A$3:$J$71,10,FALSE)","v":"강화-공격력 증가 : 비율(%)"},null,null,"Instantly","0 (사용 안함)","즉시 발동","2025.11.19 이승우 추가"]
[21010,"spe_01_03","ATK_DMG_Mul","Self","Instantly",1,false,"Debuff","DmgMul","None",-0.1,"0","0","0",{"$f":"VLOOKUP(C32,StatusConditionsList!$A$3:$J$71,10,FALSE)","v":"강화-공격력 증가 : 비율(%)"}]
[21011,"spe_03_00","PC_Evasion_All","Self","Instantly",1,false,"Buff","Avoid_Melee","Avoid_Range","10%","10%","0","0",{"$f":"VLOOKUP(C33,StatusConditionsList!$A$3:$J$71,10,FALSE)","v":"영웅 근접 / 원거리 회피 확률에 고정(+) 확률을 각각 추가"}]
[21012,"spe_03_02","PC_Evasion_All","Self","Instantly",1,false,"Debuff","Avoid_Melee","Avoid_Range","-10%","-10%","0","0",{"$f":"VLOOKUP(C34,StatusConditionsList!$A$3:$J$71,10,FALSE)","v":"영웅 근접 / 원거리 회피 확률에 고정(+) 확률을 각각 추가"},null,null,"AvoidAll_1Time"]
[21013,"spe_04_00","PC_Accuracy_Add","Self","Instantly",1,false,"Buff","HitRate","None","10","0","0","0",{"$f":"VLOOKUP(C35,StatusConditionsList!$A$3:$J$71,10,FALSE)","v":"영웅 기본 명중력에 고정(+) 값을 추가"}]
[21014,"spe_04_01","PC_Accuracy_Add","Self","Instantly",1,false,"Debuff","HitRate","None","-10","0","0","0",{"$f":"VLOOKUP(C36,StatusConditionsList!$A$3:$J$71,10,FALSE)","v":"영웅 기본 명중력에 고정(+) 값을 추가"}]
[21015,"spe_04_02","PC_Critical_Add","Self","Instantly",1,false,"Buff","Cri","None","10%","0","0","0",{"$f":"VLOOKUP(C37,StatusConditionsList!$A$3:$J$71,10,FALSE)","v":"영웅 기본 치명타 확률에 고정(+) 확률 값을 추가"}]
[21016,"spe_04_03","PC_Critical_Add","Self","Instantly",1,false,"Debuff","Cri","None","-10%","0","0","0",{"$f":"VLOOKUP(C38,StatusConditionsList!$A$3:$J$71,10,FALSE)","v":"영웅 기본 치명타 확률에 고정(+) 확률 값을 추가"}]
[21017,"spe_05_00","PC_CriticalRate_Add","Self","Instantly",1,false,"Buff","CriDmg","None","30%","0","0","0",{"$f":"VLOOKUP(C39,StatusConditionsList!$A$3:$J$71,10,FALSE)","v":"치명타 피해량 증가"}]
[21018,"spe_05_01","PC_CriticalRate_Add","Self","Instantly",1,false,"Debuff","CriDmg","None","-30%","0","0","0",{"$f":"VLOOKUP(C40,StatusConditionsList!$A$3:$J$71,10,FALSE)","v":"치명타 피해량 증가"}]
[21019,"spe_05_02","ATK_SPD_Add","Self","Instantly",1,false,"Buff","None","None","15%","0","0","0",{"$f":"VLOOKUP(C41,StatusConditionsList!$A$3:$J$71,10,FALSE)","v":"강화-공속 증가 : 고정(+)"}]
[21020,"spe_01_00","ATK_SPD_Add","Self","Instantly",1,false,"Debuff","None","None","-15%","0","0","0",{"$f":"VLOOKUP(C42,StatusConditionsList!$A$3:$J$71,10,FALSE)","v":"강화-공속 증가 : 고정(+)"}]
[22001,"spe_01_01","Recovery_All","Self","Sancturay",1,false,"None","None","None","0","0","0",0,{"$f":"VLOOKUP(C43,StatusConditionsList!$A$3:$J$70,10,FALSE)","v":"HP & 실드 완전 회복"}]
[22002,"spe_01_02","LvUp","Self","Sancturay",1,false,"None","None","None","1","0","0",0,{"$f":"VLOOKUP(C44,StatusConditionsList!$A$3:$J$70,10,FALSE)","v":"남은 경험치 무시하고 즉시 레벨업"}]
[22003,"spe_01_03","AddResurrection","Self","Sancturay",1,false,"Buff","Resurrection","None","1","0","0",0,{"$f":"VLOOKUP(C45,StatusConditionsList!$A$3:$J$70,10,FALSE)","v":"부활 횟수 추가"}]
[22004,"spe_03_00","GetSkillCard_Random","Self","Sancturay",1,false,"None","None","None","1","0","0",0,{"$f":"VLOOKUP(C46,StatusConditionsList!$A$3:$J$70,10,FALSE)","v":"일반~전설 등급 중 랜덤 카드 획득(등장 확률 = 등급 별 가중치)"}]
[22005,"spe_03_02","IncreaseEXP_Mul","Self","Sancturay",1,false,"Buff","None","None","100%","0","0",0,{"$f":"VLOOKUP(C47,StatusConditionsList!$A$3:$J$70,10,FALSE)","v":"경험치 획득량 증가"}]
[22006,"spe_04_00","IncreaseGold_Mul","Self","Sancturay",1,false,"Buff","None","None","100%","0","0",0,{"$f":"VLOOKUP(C48,StatusConditionsList!$A$3:$J$70,10,FALSE)","v":"골드 획득량 증가"}]
[22007,"spe_04_01","GetSoul_Add","Self","Sancturay",1,false,"None","None","None","10","0","0",0,{"$f":"VLOOKUP(C49,StatusConditionsList!$A$3:$J$70,10,FALSE)","v":"소울 획득 (즉시 증가)"}]
[22008,"spe_04_02","GetGold_Add","Self","Sancturay",1,false,"None","None","None","25","0","0",0,{"$f":"VLOOKUP(C50,StatusConditionsList!$A$3:$J$70,10,FALSE)","v":"골드 획득 (즉시 증가)"}]
[22009,"spe_04_03","Invincibility_Time","Self","Sancturay",1,false,"Buff","None","None","10s","0","0",0,{"$f":"VLOOKUP(C51,StatusConditionsList!$A$3:$J$70,10,FALSE)","v":"무적 : 지속 시간"}]
[23001,"spe_05_00","Heal_Hp_Random","Self","Sancturay",1,false,"None","None","None","1","10","0",0,{"$f":"VLOOKUP(C52,StatusConditionsList!$A$3:$J$70,10,FALSE)","v":"HP 회복 : 고정 랜덤(+)"}]
[23002,"spe_05_01","GetExp_Add","Self","Sancturay",1,false,"None","None","None","15","0","0",0,{"$f":"VLOOKUP(C53,StatusConditionsList!$A$3:$J$70,10,FALSE)","v":"경험치 획득 (즉시 증가)"}]
[23003,"spe_05_02","Heal_Shield_Random","Self","Sancturay",1,false,"None","None","None","1","10","0",0,{"$f":"VLOOKUP(C54,StatusConditionsList!$A$3:$J$70,10,FALSE)","v":"실드 회복 : 고정 랜덤(+)"}]
[31001,"spe_01_00","Cri_Add","Self","None",1,false,"Buff","Cri","None","10%",0,0,0,"크리티컬 10%"]
[31002,"spe_01_01","Berserker_ATK_SPD_Mul","Self","MaxHpRate","50%",false,"Buff","AttackCoolTimeMul","None","50%",0,0,0,"광포화- 신속화 30%"]
[31003,"spe_01_02","Berserker_ATK_DMG_Mul","Self","MaxHpRate","50%",false,"Buff","DmgMul","None","50%",0,0,0,"광포화- 공격력 50%"]
[31004,"spe_01_03","ATK_DMG_Mul","Self","None",1,false,"Buff","DmgMul","None","200%",0,0,0,"체력 2배"]
[32004,"spe_03_00","MaxHp_Mul","Self","None",1,false,"Buff","MaxHP_Mul","None","200%",0,0,0,"최대 공격력 2배"]
[31005,"spe_03_02","Slow","Enemy","Attack_Hit","30%",false,"Debuff","Slow","None","3s",-0.5,0,0,"둔화 30%"]
[31006,"spe_04_00","Poison","Enemy","Attack_Hit",1,true,"Debuff","None","None","5s","1",0,0,"중독 5초"]
[31007,"spe_04_01","Heal_Shield_Random","Self","Hit_Noraml","20%",false,"Buff","Shield","None","5","10",0,0,"피격 시 20% 확률로 실드 랜덤 회복"]
[31008,"spe_04_02","Heal_Hp_Random","Self","Attack_Hit","100%",false,"Buff","HP","None","1","5",0,0,"고정 생명 회복"]
[31009,"spe_04_03","Invincibility_Time","Self","Appear","100%",false,"Buff","None","None","5s",0,0,0,"무적 5초"]
[31010,"spe_05_00","Berserker_ATK_SPD_Mul","Self","MaxHpRate","50%",false,"Buff","AttackCoolTimeMul","None","30%",0,0,0,"광포화 - 신속"]
[32010,"spe_05_01","Cri_Add","Self","None",1,false,"Buff","Cri","None","15%",0,0,0,"크리티컬 15%"]
[31011,"spe_05_02","Invincibility_Count","Self","Appear","100%",false,"Buff","Dmg_Immune","None","1",0,0,0,"피해 무효"]
[32011,"spe_01_00","ATK_DMG_Mul","Self","None",1,false,"Buff","DmgMul","None","15%",0,0,0,"강화 -공격력"]
[31012,"spe_01_01","Berserker_ATK_SPD_Mul","Self","MaxHpRate","50%",false,"Buff","AttackCoolTimeMul","None","80%",0,0,0,"광포화 신속화 80%"]
[32012,"spe_01_02","Cri_Add","Self","None",1,false,"Buff","Cri","None","15%",0,0,0,"치명타 15%"]
[31013,"spe_01_03","Slow","Enemy","Attack_Hit","15%",false,"Debuff","Slow","None","3s",-0.5,0,0,"공격 시 10%, 둔화 50% 3초"]
[{"$f":"A71+1000","v":32013},"spe_03_00","Heal_Shield_Random","Self","Hit_Noraml","20%",false,"Buff","Shield","None","5","10",0,0,"피격 시 20%, 실드 회복"]
[{"$f":"A71+1","v":31014},"spe_03_02","Burn","Enemy","Attack_Hit","15%",true,"Debuff","None","None","3s","-10%",0,0,"화상"]
[{"$f":"A73+1000","v":32014},"spe_04_00","ATK_DMG_Mul","Self","None",1,false,"Buff","DmgMul","None","25%",0,0,0,"공격력 25%"]
[{"$f":"A73+1","v":31015},"spe_04_01","Stun","Enemy","Attack_Hit","10%",false,"Debuff","None","None","1s",0,0,0,"기절"]
[{"$f":"A75+1000","v":32015},"spe_04_02","Cri_Add","Self","None",1,false,"Buff","Cri","None","15%",0,0,0,"치명타 15%"]
[{"$f":"A75+1","v":31016},"spe_04_03","Berserker_ATK_SPD_Mul","Self","MaxHpRate","50%",false,"Buff","AttackCoolTimeMul","None","50%",0,0,0,"광포화 신속"]
[{"$f":"A77+1000","v":32016},"spe_05_00","Berserker_ATK_DMG_Mul","Self","MaxHpRate","50%",false,"Buff","DmgMul","None","50%",0,0,0,"광포화 공격력"]
[{"$f":"A77+1","v":31017},"spe_05_01","VampirHeal_Add","Enemy","Attack_Hit","100%",false,"Debuff","FixedDmg","HP",1,"1",0,0,"고정 피해 흡혈"]
[{"$f":"A79+1000","v":32017},"spe_05_02","Heal_Shield_Mul","Self","Hit_Count","3",false,"Buff","Shield","None","10%",0,0,0,"실드 회복"]
[{"$f":"A79+1","v":31018},"spe_01_00","ATK_DMG_Mul","Self","None",1,false,"Buff","DmgMul","None","25%",0,0,0,"강화  공격력"]
[{"$f":"A81+1000","v":32018},"spe_01_01","Resurrection","Self","Die_Self","1",false,"Buff","Resurrection_Heal","Resurrection_Shield","50%","0",0,0,"부활"]
[{"$f":"A81+1","v":31019},"spe_01_02","Burn","Enemy","Attack_Hit","15%",true,"Debuff","None","None","3s","-10%",0,0,"화상"]
[{"$f":"A83+1000","v":32019},"spe_01_03","Heal_Hp_Mul","Self","ActiveSkill","8s",false,"Buff","None","None",0.1,0,0,0,"회복"]
[{"$f":"A83+1","v":31020},"spe_03_00","Poison","Enemy","Attack_Hit",1,true,"Debuff","None","None","5s","3",0,0,"중독 5초, -3"]
[{"$f":"A85+1000","v":32020},"spe_03_02","Heal_Shield_Mul","Self","ActiveSkill","8s",false,"Buff","None","None",0.1,0,0,0,"실드 회복"]
[{"$f":"A85+1","v":31021},"spe_04_00","Invincibility_Count","Self","Appear","100%",false,"Buff","Dmg_Immune","None","3",0,0,0,"피해 무효 3"]
[{"$f":"A87+1000","v":32021},"spe_04_01","ATK_SPD_Mul","Self","None",1,false,"Buff","AttackCoolTimeMul","None","30%",0,0,0,"신속화"]
[{"$f":"A87+1","v":31022},"spe_04_02","Berserker_ATK_DMG_Mul","Self","MaxHpRate","50%",false,"Buff","DmgMul","None","50%",0,0,0,"광포화 공격력"]
[{"$f":"A89+1000","v":32022},"spe_04_03","Burn","Enemy","Attack_Hit","100%",true,"Debuff","None","None","2s","-5%",0,0,"화상"]
[{"$f":"A89+1","v":31023},"spe_05_00","Heal_Hp_Random","Self","ActiveSkill","3s",false,"Buff","HP","None","1","3",0,0,"회복"]
[{"$f":"A91+1000","v":32023},"spe_05_01","Burn","Enemy","Attack_Hit","15%",true,"Debuff","None","None","3s","-10%",0,0,"화상"]
[{"$f":"A91+1","v":31024},"spe_05_02","Heal_Shield_Random","Self","Hit_Noraml","25%",false,"Buff","Shield","None","5","10",0,0,"실드 회복"]
[{"$f":"A93+1000","v":32024},"spe_01_00","Slow","Enemy","Attack_Hit","15%",false,"Debuff","Slow","None","3s",-0.8,0,0,"둔화"]
[{"$f":"A93+1","v":31025},"spe_01_01","Poison","Enemy","Attack_Hit",0.15,true,"Debuff","None","None","5s","10",0,0,"중독 5초"]
[{"$f":"A95+1000","v":32025},"spe_01_02","Slow","Enemy","Attack_Hit","100%",false,"Debuff","Slow","None","2s",-0.3,0,0,"2초, 둔화 30%"]
[{"$f":"A95+1","v":31026},"spe_01_03","Berserker_ATK_SPD_Mul","Self","MaxHpRate","50%",false,"Buff","AttackCoolTimeMul","None","80%",0,0,0,"광포화 신속화 60%"]
[{"$f":"A97+1000","v":32026},"spe_03_00","Resurrection","Self","Die_Self","1",false,"Buff","Resurrection_Heal","Resurrection_Shield","50%","50%",0,0,"부활"]
[{"$f":"A97+1","v":31027},"spe_03_02","Invincibility_Count","Self","Appear","100%",false,"Buff","Dmg_Immune","None","3",0,0,0,"피해 무효"]
[{"$f":"A99+1000","v":32027},"spe_04_00","Heal_Hp_Random","Self","ActiveSkill","2.5s",false,"Buff","HP","None","2","4",0,0,"회복"]
[{"$f":"A99+1","v":31028},"spe_04_01","Invincibility_Time","Self","Evasion_Rate","100%",false,"Buff","None","None","1.5s",0,0,0,"무적"]
[{"$f":"A101+1000","v":32028},"spe_04_02","Resurrection","Self","Die_Self","1",false,"Buff","Resurrection_Heal","Resurrection_Shield","100%","100%",0,0,"부활"]
[41001,"spe_04_03","ATK_DMG_Add","Self","None",1,false,"Buff","None","None","0",0,0,0,"공속 빠름"]
[41002,"spe_05_00","ATK_DMG_Add","Self","None",1,false,"Buff","None","None","0",0,0,0,"공속 빠름"]
[41003,"spe_05_01","ATK_DMG_Add","Self","None",1,false,"Buff","None","None","0",0,0,0,"공속 빠름"]
[41004,"spe_05_02","ATK_DMG_Add","Self","None",1,false,"Buff","None","None","0",0,0,0,"공속 빠름"]
[41005,"spe_01_00","ATK_DMG_Add","Self","None",1,false,"Buff","None","None","0",0,0,0,"공속 빠름"]
[41006,"spe_01_01","ATK_DMG_Add","Self","None",1,false,"Buff","None","None","0",0,0,0,"공속 빠름"]
[41007,"spe_01_02","Cri_Add","Self","None",1,false,"Buff","Cri","None","5%",0,0,0,"치명타 5%"]
[41008,"spe_01_03","Cri_Add","Self","None",1,false,"Buff","Cri","None","5%",0,0,0,"치명타 5%"]
[41009,"spe_03_00","ATK_DMG_Add","Self","None",1,false,"Buff","None","None","0",0,0,0,"체력 10%"]
[41010,"spe_03_02","ATK_DMG_Add","Self","None",1,false,"Buff","None","None","0",0,0,0,"체력 10%"]
[41011,"spe_04_00","ATK_DMG_Add","Self","None",1,false,"Buff","None","None","0",0,0,0,"체력 10%"]
[41012,"spe_04_01","ATK_DMG_Add","Self","None",1,false,"Buff","None","None","0",0,0,0,"체력 10%"]
[41013,"spe_04_02","ATK_DMG_Add","Self","None",1,false,"Buff","None","None","0",0,0,0,"체력 10%"]
[41014,"spe_04_03","ATK_DMG_Add","Self","None",1,false,"Buff","None","None","0",0,0,0,"체력 10%"]
[41015,"spe_05_00","Invincibility_Count","Self","Appear","100%",false,"Buff","Dmg_Immune","None","1",0,0,0,"피해 무효"]
[41016,"spe_05_01","Invincibility_Count","Self","Appear","100%",false,"Buff","Dmg_Immune","None","1",0,0,0,"피해 무효"]
[41017,"spe_05_02","ATK_DMG_Add","Self","None",1,false,"Buff","None","None","0",0,0,0,"공격력 15%"]
[41018,"spe_01_00","ATK_DMG_Add","Self","None",1,false,"Buff","None","None","0",0,0,0,"공격력 15%"]
[41019,"spe_01_01","ATK_DMG_Add","Self","None",1,false,"Buff","None","None","0",0,0,0,"공격력 15%"]
[41020,"spe_01_02","ATK_DMG_Add","Self","None",1,false,"Buff","None","None","0",0,0,0,"공격력 15%"]
[41021,"spe_01_03","ATK_DMG_Add","Self","None",1,false,"Buff","None","None","0",0,0,0,"공격력 15%"]
[41022,"spe_03_00","ATK_DMG_Add","Self","None",1,false,"Buff","None","None","0",0,0,0,"공격력 15%"]
[41023,"spe_03_02","ATK_DMG_Add","Self","None",1,false,"Buff","None","None","0",0,0,0,"공격력 15%"]
[41024,"spe_04_00","CriticalRate_Add","Self","None",1,false,"Buff","CriDmg","None",0.3,0,0,0,"치명타 피해량 + 30%"]
[41025,"spe_04_01","CriticalRate_Add","Self","None",1,false,"Buff","CriDmg","None",0.3,0,0,0,"치명타 피해량 + 30%"]
[41026,"spe_04_02","CriticalRate_Add","Self","None",1,false,"Buff","CriDmg","None",0.3,0,0,0,"치명타 피해량 + 30%"]
[41027,"spe_04_03","ATK_DMG_Add","Self","None",1,false,"Buff","None","None","0",0,0,0,"생명력 20%"]
[41028,"spe_05_00","ATK_DMG_Add","Self","None",1,false,"Buff","None","None","0",0,0,0,"생명력 20%"]
[41029,"spe_05_01","Heal_Hp_Random","Self","Hit_Noraml","10%",false,"Buff","HP","None","1","5",0,0,"회복"]
[41030,"spe_05_02","Heal_Hp_Random","Self","Hit_Noraml","10%",false,"Buff","HP","None","1","5",0,0,"회복"]
[41031,"spe_01_00","Heal_Hp_Random","Self","Hit_Noraml","10%",false,"Buff","HP","None","1","5",0,0,"회복"]
[51001,"spe_01_01","ATK_SPD_Add","Self","None",1,false,"Buff","None","None",0.15,0,0,0,"공격속도 빠름"]
[52001,"spe_01_02","Cri_Add","Self","None",1,false,"Buff","Cri","None","5%",0,0,0,"치명타 5%"]
[51002,"spe_01_03","ATK_SPD_Add","Self","None",1,false,"Buff","None","None",0.15,0,0,0,"공격속도 빠름"]
[52002,"spe_03_00","Cri_Add","Self","None",1,false,"Buff","Cri","None","5%",0,0,0,"치명타 5%"]
[51003,"spe_03_02","ATK_SPD_Add","Self","None",1,false,"Buff","None","None",0.15,0,0,0,"공격속도 빠름"]
[52003,"spe_04_00","Cri_Add","Self","None",1,false,"Buff","Cri","None","5%",0,0,0,"치명타 5%"]
[51004,"spe_04_01","Death_ATK_Mul","Self","Die_Ally",1,false,"Buff","DmgMul","None","20%",0,0,0,"사망 - 공격력"]
[51005,"spe_04_02","Death_ATK_Mul","Self","Die_Ally",1,false,"Buff","DmgMul","None","20%",0,0,0,"사망 - 공격력"]
[51006,"spe_04_03","Death_ATK_Mul","Self","Die_Ally",1,false,"Buff","DmgMul","None","20%",0,0,0,"사망 - 공격력"]
[51007,"spe_05_00","Death_ATK_Mul","Self","Die_Ally",1,false,"Buff","DmgMul","None","20%",0,0,0,"사망 - 공격력"]
[51008,"spe_05_01","Berserker_ATK_DMG_Mul","Self","MaxHpRate","50%",false,"Buff","DmgMul","None","50%",0,0,0,"광포화 - 공격력"]
[52008,"spe_05_02","CriticalRate_Add","Self","None","100%",false,"Buff","CriDmg","None","30%",0,0,0,"치명타 피해량 30%"]
[51009,"spe_01_00","Berserker_ATK_DMG_Mul","Self","MaxHpRate","50%",false,"Buff","DmgMul","None","50%",0,0,0,"광포화 - 공격력"]
[52009,"spe_01_01","CriticalRate_Add","Self","None","100%",false,"Buff","CriDmg","None","30%",0,0,0,"치명타 피해량 30%"]
[51010,"spe_01_02","Berserker_ATK_DMG_Mul","Self","MaxHpRate","50%",false,"Buff","DmgMul","None","50%",0,0,0,"광포화 - 공격력"]
[52010,"spe_01_03","CriticalRate_Add","Self","None","100%",false,"Buff","CriDmg","None","30%",0,0,0,"치명타 피해량 30%"]
[51011,"spe_03_00","Berserker_ATK_DMG_Mul","Self","MaxHpRate","50%",false,"Buff","DmgMul","None","50%",0,0,0,"광포화 - 공격력"]
[52011,"spe_03_02","CriticalRate_Add","Self","None","100%",false,"Buff","CriDmg","None","30%",0,0,0,"치명타 피해량 30%"]
[51012,"spe_04_00","Berserker_ATK_DMG_Mul","Self","MaxHpRate","50%",false,"Buff","DmgMul","None","50%",0,0,0,"광포화 - 공격력"]
[52012,"spe_04_01","CriticalRate_Add","Self","None","100%",false,"Buff","CriDmg","None","30%",0,0,0,"치명타 피해량 30%"]
[51013,"spe_04_02","Berserker_ATK_DMG_Mul","Self","MaxHpRate","50%",false,"Buff","DmgMul","None","50%",0,0,0,"광포화 - 공격력"]
[52013,"spe_04_03","CriticalRate_Add","Self","None","100%",false,"Buff","CriDmg","None","30%",0,0,0,"치명타 피해량 30%"]
[51014,"spe_05_00","Invincibility_Count","Self","Appear","100%",false,"Buff","Dmg_Immune","None","1",0,0,0,"피해 무효"]
[52014,"spe_05_01","Cri_Add","Self","None","100%",false,"Buff","Cri","None","5%","0","0","0","치명타 5%"]
[51015,"spe_05_02","Invincibility_Count","Self","Appear","100%",false,"Buff","Dmg_Immune","None","1",0,0,0,"피해 무효"]
[52015,"spe_01_00","Cri_Add","Self","None","100%",false,"Buff","Cri","None","5%","0","0","0","치명타 5%"]
[51016,"spe_01_01","Invincibility_Count","Self","Appear","100%",false,"Buff","Dmg_Immune","None","1",0,0,0,"피해 무효"]
[52016,"spe_01_02","Cri_Add","Self","None","100%",false,"Buff","Cri","None","5%","0","0","0","치명타 5%"]
[51017,"spe_01_03","Slow","Enemy","Attack_Hit","25%",false,"Debuff","Slow","None","2.5s",-0.5,0,0,"둔화 50%"]
[51018,"spe_03_00","Heal_Hp_Random","Random_Ally","Attack_Normal","100%",false,"Buff","HP","None","3","5",0,0,"회복"]
[51019,"spe_03_02","Burn","Enemy","Attack_Hit","15%",true,"Debuff","None","None","3s","-5%",0,0,"화상"]
[51020,"spe_04_00","Poison","Enemy","Attack_Hit",0.25,true,"Debuff","None","None","5s","3",0,0,"중독 5초"]
[51021,"spe_04_01","Berserker_ATK_DMG_Mul","Self","MaxHpRate","50%",false,"Buff","DmgMul","None","50%",0,0,0,"광전사 2배"]
[51022,"spe_04_02","Cri_Add","Self","None",1,false,"Buff","Cri","None","20%",0,0,0,"치명타 확률 20%"]
[51023,"spe_04_03","Cri_Add","Self","None",1,false,"Buff","Cri","None","20%",0,0,0,"치명타 확률 20%"]
[51024,"spe_05_00","Cri_Add","Self","None",1,false,"Buff","Cri","None","20%",0,0,0,"치명타 확률 20%"]
[51025,"spe_05_01","VampirHeal_Mul","Enemy","Attack_Hit","100%",false,"Buff","None","None",0.5,0.5,0,0,"흡혈"]
[52025,"spe_05_02","ATK_SPD_Add","Self","None",1,false,"Buff","None","None",0.25,0,0,0,"공격속도 빠름"]
[51026,"spe_01_00","VampirHeal_Mul","Enemy","Attack_Hit","100%",false,"Buff","None","None",0.5,0.5,0,0,"흡혈"]
[52026,"spe_01_01","ATK_SPD_Add","Self","None",1,false,"Buff","None","None",0.25,0,0,0,"공격속도 빠름"]
[51027,"spe_01_02","VampirHeal_Mul","Enemy","Attack_Hit","100%",false,"Buff","None","None",0.5,0.5,0,0,"흡혈"]
[52027,"spe_01_03","ATK_SPD_Add","Self","None",1,false,"Buff","None","None",0.25,0,0,0,"공격속도 빠름"]
[51028,"spe_03_00","Death_Heal_Mul","Self","None",1,false,"Buff","None","None",0.25,0,0,0,"사망 - 회복"]
[51029,"spe_03_02","Death_Heal_Mul","Self","None",1,false,"Buff","None","None",0.25,0,0,0,"사망 - 회복"]
[51030,"spe_04_00","Death_Heal_Mul","Self","None",1,false,"Buff","None","None",0.25,0,0,0,"사망 - 회복"]
[51031,"spe_04_01","Death_Heal_Mul","Self","None",1,false,"Buff","None","None",0.25,0,0,0,"사망 - 회복"]
[51032,"spe_04_02","Death_Heal_Mul","Self","None",1,false,"Buff","None","None",0.25,0,0,0,"사망 - 회복"]
[51033,"spe_04_03","Death_Heal_Mul","Self","None",1,false,"Buff","None","None",0.25,0,0,0,"사망 - 회복"]
[51034,"spe_05_00","Death_Heal_Mul","Self","None",1,false,"Buff","None","None",0.25,0,0,0,"사망 - 회복"]
[51035,"spe_05_01","ATK_DMG_Mul","Self","None",1,false,"Buff","DmgMul","None","15%",0,0,0,"공격력 15%"]
[52035,"spe_05_02","ATK_SPD_Add","Self","None",1,false,"Buff","None","None",0.15,0,0,0,"공격속도 빠름"]
[51036,"spe_01_00","ATK_DMG_Mul","Self","None",1,false,"Buff","DmgMul","None","15%",0,0,0,"공격력 15%"]
[52036,"spe_01_01","ATK_SPD_Add","Self","None",1,false,"Buff","None","None",0.15,0,0,0,"공격속도 빠름"]
[51037,"spe_01_02","ATK_DMG_Mul","Self","None",1,false,"Buff","DmgMul","None","15%",0,0,0,"공격력 15%"]
[52037,"spe_01_03","ATK_SPD_Add","Self","None",1,false,"Buff","None","None",0.15,0,0,0,"공격속도 빠름"]
[61001,"spe_03_00","Heal_Shield_Mul","Self","Die_Ally","100%",false,"Buff","None","None","50%",0,0,0,"실드 회복"]
[62001,"spe_03_02","ATK_DMG_Mul","Self","None",1,false,"Buff","DmgMul","None","20%",0,0,0,"공격력 20%"]
[61002,"spe_04_00","Heal_Shield_Mul","Self","Die_Ally","100%",false,"Buff","None","None","50%",0,0,0,"실드 회복"]
[62002,"spe_04_01","ATK_DMG_Mul","Self","None",1,false,"Buff","DmgMul","None","20%",0,0,0,"공격력 20%"]
[61003,"spe_04_02","Heal_Shield_Mul","Self","Die_Ally","100%",false,"Buff","None","None","50%",0,0,0,"실드 회복"]
[62003,"spe_04_03","ATK_DMG_Mul","Self","None",1,false,"Buff","DmgMul","None","20%",0,0,0,"공격력 20%"]
[61004,"spe_05_00","Death_Heal_Mul","Self","Die_Ally","100%",false,"Buff","None","None","50%",0,0,0,"사망 회복"]
[61005,"spe_05_01","Death_Heal_Mul","Self","Die_Ally","100%",false,"Buff","None","None","50%",0,0,0,"사망 회복"]
[61006,"spe_05_02","ATK_DMG_Mul","Self","None",1,false,"Buff","DmgMul","None","30%",0,0,0,"공격력 증가"]
[61007,"spe_01_00","Poison","Enemy","Attack_Hit",1,true,"Debuff","None","None","5s","1",0,0,"중독 5초"]
[61008,"spe_01_01","Poison","Enemy","Attack_Hit",1,true,"Debuff","None","None","5s","1",0,0,"중독 5초"]
[61009,"spe_01_02","Poison","Enemy","Attack_Hit",1,true,"Debuff","None","None","5s","1",0,0,"중독 5초"]
[61010,"spe_01_03","Berserker_ATK_DMG_Mul","Self","MaxHpRate","50%",false,"Buff","DmgMul","None","50%",0,0,0,"광포화"]
[61011,"spe_03_00","Berserker_ATK_DMG_Mul","Self","MaxHpRate","50%",false,"Buff","DmgMul","None","50%",0,0,0,"광포화"]
[61012,"spe_03_02","Berserker_ATK_DMG_Mul","Self","MaxHpRate","50%",false,"Buff","DmgMul","None","50%",0,0,0,"광포화"]
[61013,"spe_04_00","Berserker_ATK_DMG_Mul","Self","MaxHpRate","50%",false,"Buff","DmgMul","None","50%",0,0,0,"광포화"]
[61014,"spe_04_01","MaxShield_Mul","Self","None",1,false,"Buff","MaxShield_Mul","None","30%",0,0,0,"실드 증가"]
[61015,"spe_04_02","MaxShield_Mul","Self","None",1,false,"Buff","MaxShield_Mul","None","30%",0,0,0,"실드 증가"]
[61016,"spe_04_03","Heal_Hp_Mul","Self","Attack_Normal","10%",false,"Buff","None","None","10%",0,0,0,"회복"]
[61017,"spe_05_00","Heal_Hp_Mul","Self","Attack_Normal","10%",false,"Buff","None","None","10%",0,0,0,"회복"]
[61018,"spe_05_01","Heal_Hp_Mul","Self","Attack_Normal","10%",false,"Buff","None","None","10%",0,0,0,"회복"]
[61019,"spe_05_02","Heal_Hp_Mul","Self","Attack_Normal","10%",false,"Buff","None","None","10%",0,0,0,"회복"]
[61020,"spe_01_00","Poison","Enemy","Attack_Hit",0.2,true,"Debuff","None","None","5s","3",0,0,"중독 5초"]
[61021,"spe_01_01","Destruct","Self","MaxHp_Down","20%",false,"Buff","Self_Destruct","None","200%","3",0,0,"자폭"]
[61022,"spe_01_02","Cri_Add","Self","None","100%",false,"Buff","Cri","None","15%","0","0","0","치명타 15%"]
[62022,"spe_01_03","CriticalRate_Add","Self","None",1,false,"Buff","CriDmg","None","50%",0,0,0,"치명타 피해량 50%"]
[61023,"spe_03_00","Evasion_All","Self","None",1,false,"Buff","Avoid_Melee","Avoid_Range","2","2",0,0,"회피력"]
[61024,"spe_03_02","Evasion_All","Self","None",1,false,"Buff","Avoid_Melee","Avoid_Range","2","2",0,0,"회피력"]
[61025,"spe_04_00","Invincibility_Count","Self","Appear","100%",false,"Buff","Dmg_Immune","None","1",0,0,0,"피해 무효"]
[61026,"spe_04_01","Invincibility_Count","Self","Appear","100%",false,"Buff","Dmg_Immune","None","1",0,0,0,"피해 무효"]
[61027,"spe_04_02","Invincibility_Count","Self","Appear","100%",false,"Buff","Dmg_Immune","None","1",0,0,0,"피해 무효"]
[61028,"spe_04_03","Resurrection","Self","Die_Self","1",false,"Buff","Resurrection_Heal","Resurrection_Shield","50%","0",0,0,"부활"]
[62028,"spe_05_00","Berserker_ATK_DMG_Mul","Self","MaxHpRate","50%",false,"Buff","DmgMul","None","50%",0,0,0,"버서커 공속"]
[61029,"spe_05_01","Resurrection","Self","Die_Self","1",false,"Buff","Resurrection_Heal","Resurrection_Shield","50%","0",0,0,"부활"]
[62029,"spe_05_02","Invincibility_Count","Self","Appear","100%",false,"Buff","Dmg_Immune","None","1",0,0,0,"피해 무효"]
[61030,"spe_01_00","Resurrection","Self","Die_Self","1",false,"Buff","Resurrection_Heal","Resurrection_Shield","50%","0",0,0,"부활"]
[62030,"spe_01_01","Heal_Hp_Mul","Self","Attack_Normal","15%",false,"Buff","None","None","20%",0,0,0,"회복"]
[61031,"spe_01_02","Resurrection","Self","Die_Self","1",false,"Buff","Resurrection_Heal","Resurrection_Shield","50%","0",0,0,"부활"]
[61032,"spe_01_03","Resurrection","Self","Die_Self","1",false,"Buff","Resurrection_Heal","Resurrection_Shield","50%","0",0,0,"부활"]
[61033,"spe_03_00","Resurrection","Self","Die_Self","1",false,"Buff","Resurrection_Heal","Resurrection_Shield","50%","0",0,0,"부활"]
[61034,"spe_03_02","Resurrection","Self","Die_Self","1",false,"Buff","Resurrection_Heal","Resurrection_Shield","50%","0",0,0,"부활"]
[71001,"spe_04_00","Poison","Enemy","Attack_Hit",0.1,true,"Debuff","None","None","5s","1",0,0,"중독 5초"]
[71002,"spe_04_01","ATK_DMG_Add","Self","None",1,false,"Buff","None","None","0",0,0,0,"-"]
[71003,"spe_04_02","Poison","Enemy","Attack_Hit",0.05,true,"Debuff","None","None","5s","2",0,0,"중독 5초"]
[71004,"spe_04_03","Berserker_ATK_DMG_Mul","Self","MaxHpRate","50%",false,"Buff","DmgMul","None","50%",0,0,0,"광전사 2배"]
[71005,"spe_05_00","Slow","Enemy","Attack_Hit","30%",false,"Debuff","Slow","None","3s",-0.3,0,0,"슬로우"]
[71006,"spe_05_01","Cri_Add","Self","None",1,false,"Buff","Cri","None","20%",0,0,0,"치명타 확률"]
[72006,"spe_05_02","CriticalRate_Add","Self","None",1,false,"Buff","CriDmg","None","50%",0,0,0,"치명타 피해량"]
[71007,"spe_01_00","Berserker_ATK_DMG_Mul","Self","MaxHpRate","50%",false,"Buff","DmgMul","None","50%",0,0,0,"광전사 공격력"]
[71008,"spe_01_01","Berserker_ATK_DMG_Mul","Self","MaxHpRate","50%",false,"Buff","DmgMul","None","50%",0,0,0,"광전사 공격력"]
[71009,"spe_01_02","Berserker_ATK_DMG_Mul","Self","MaxHpRate","50%",false,"Buff","DmgMul","None","50%",0,0,0,"광전사 공격력"]
[71010,"spe_01_03","Cri_Add","Self","None",1,false,"Buff","Cri","None","20%",0,0,0,"치명타 확률"]
[71011,"spe_03_00","Cri_Add","Self","None",1,false,"Buff","Cri","None","20%",0,0,0,"치명타 확률"]
[71012,"spe_03_02","Heal_Hp_Mul","Self","Hit_Noraml","10%",false,"Buff","None","None","15%",0,0,0,"회복"]
[71013,"spe_04_00","Poison","Enemy","Attack_Hit",0.05,true,"Debuff","None","None","5s","1",0,0,"중독 5초"]
[71014,"spe_04_01","Poison","Enemy","Attack_Hit",0.05,true,"Debuff","None","None","5s","1",0,0,"중독 5초"]
[71015,"spe_04_02","Cri_Add","Self","None",1,false,"Buff","Cri","None","15%",0,0,0,"치명타 확률"]
[72015,"spe_04_03","CriticalRate_Add","Self","None",1,false,"Buff","CriDmg","None","50%",0,0,0,"치명타 피해"]
[71016,"spe_05_00","Poison","Enemy","Attack_Hit",0.5,true,"Debuff","None","None","5s","3",0,0,"중독 5초"]
[71017,"spe_05_01","Poison","Enemy","Attack_Hit",0.5,true,"Debuff","None","None","5s","3",0,0,"중독 5초"]
[71018,"spe_05_02","ATK_DMG_Add","Self","None",1,false,"Buff","None","None","0",0,0,0,"-"]
[71019,"spe_01_00","Slow","Enemy","Attack_Hit","15%",false,"Debuff","Slow","None","3s",-0.5,0,0,"슬로우"]
[71020,"spe_01_01","Evasion_All","Self","None",1,false,"Buff","Avoid_Melee","Avoid_Range","2","2",0,0,"회피력"]
[71021,"spe_01_02","Heal_Hp_Add","Self","Hit_Noraml","25%",false,"Buff","HP","None","1",0,0,0,"회복"]
[71022,"spe_01_03","Heal_Hp_Add","Self","Hit_Noraml","25%",false,"Buff","HP","None","1",0,0,0,"회복"]
[71023,"spe_03_00","Death_Growup","Self","Die_Ally","100%",false,"Buff","DmgMul","MaxHP_Mul","200%","200%",0,0,"사망-성장"]
[71024,"spe_03_02","ATK_DMG_Add","Self","None",1,false,"Buff","None","None","0",0,0,0,"-"]
[71025,"spe_04_00","Death_Heal_Mul","Self","Die_Ally","100%",false,"Buff","None","None","20%","0","0","0","사망 회복"]
[71026,"spe_04_01","Death_ATK_Mul","Self","Die_Ally","100%",false,"Buff","DmgMul","None","25%","0","0","0","사망 공격력"]
[71027,"spe_04_02","Death_ATK_Mul","Self","Die_Ally","100%",false,"Buff","DmgMul","None","25%","0","0","0","사망 공격력"]
[71028,"spe_04_03","Death_ATK_Mul","Self","Die_Ally","100%",false,"Buff","AttackCoolTimeMul","None","15%","0","0","0","사망 공속"]
[71029,"spe_05_00","Burn","Enemy","Attack_Hit","5%",true,"Debuff","None","None","3s","-10%",0,0,"화상"]
[71030,"spe_05_01","Death_Heal_Mul","Self","Die_Ally","100%",false,"Buff","None","None","20%","0","0","0","사망 회복"]
[71031,"spe_05_02","Death_Growup","Self","Die_Ally","100%",false,"Buff","DmgMul","MaxHP_Mul","200%","200%",0,0,"사망-성장"]
[71032,"spe_01_00","Death_Growup","Self","Die_Ally","100%",false,"Buff","DmgMul","MaxHP_Mul","200%","200%",0,0,"사망-성장"]
[71033,"spe_01_01","Resurrection","Self","Die_Self","1",false,"Buff","Resurrection_Heal","Resurrection_Shield","100%","0",0,0,"부활"]
[72033,"spe_01_02","Cri_Add","Self","None",1,false,"Buff","Cri","None","15%",0,0,0,"치명타"]
[71034,"spe_01_03","VampirHeal_Mul","Enemy","Attack_Hit","100%",false,"Buff","None","None",1,1,0,0,"흡혈"]
[81001,"spe_03_00","ATK_DMG_Mul","Self","None",1,false,"Buff","DmgMul","None","25%",0,0,0,"공격력 25%"]
[82001,"spe_03_02","Cri_Add","Self","None",1,false,"Buff","Cri","None","15%",0,0,0,"치명타"]
[81002,"spe_04_00","ATK_DMG_Mul","Self","None",1,false,"Buff","DmgMul","None","25%",0,0,0,"공격력 25%"]
[82002,"spe_04_01","MaxHp_Mul","Self","None",1,false,"Buff","MaxHP_Mul","None","20%","0","0","0","생명력 20%"]
[81003,"spe_04_02","Burn","Enemy","Attack_Hit","30%",true,"Debuff","None","None","3s","-5%",0,0,"화상"]
[82003,"spe_04_03","MaxHp_Mul","Self","None",1,false,"Buff","MaxHP_Mul","None","20%","0","0","0","생명력 20%"]
[81004,"spe_05_00","ATK_DMG_Mul","Self","None",1,false,"Buff","DmgMul","None","15%",0,0,0,"공격력"]
[81005,"spe_05_01","ATK_DMG_Mul","Self","None",1,false,"Buff","DmgMul","None","15%",0,0,0,"공격력"]
[81006,"spe_05_02","ATK_DMG_Mul","Self","None",1,false,"Buff","DmgMul","None","30%",0,0,0,"공격력"]
[81007,"spe_01_00","Berserker_ATK_DMG_Mul","Self","MaxHpRate","50%",false,"Buff","DmgMul","None","50%",0,0,0,"버서커 공격력"]
[82007,"spe_01_01","ATK_DMG_Mul","Self","None",1,false,"Buff","DmgMul","None","15%",0,0,0,"공격력"]
[81008,"spe_01_02","Berserker_ATK_DMG_Mul","Self","MaxHpRate","50%",false,"Buff","DmgMul","None","50%",0,0,0,"버서커 공격력"]
[82008,"spe_01_03","ATK_DMG_Mul","Self","None",1,false,"Buff","DmgMul","None","15%",0,0,0,"공격력"]
[81009,"spe_03_00","ATK_DMG_Mul","Self","None",1,false,"Buff","DmgMul","None","25%",0,0,0,"공격력"]
[82009,"spe_03_02","MaxHp_Mul","Self","None",1,false,"Buff","MaxHP_Mul","None","15%","0","0","0","생명"]
[81010,"spe_04_00","ATK_DMG_Mul","Self","None",1,false,"Buff","DmgMul","None","25%",0,0,0,"공격력"]
[82010,"spe_04_01","MaxHp_Mul","Self","None",1,false,"Buff","MaxHP_Mul","None","15%","0","0","0","생명력"]
[81011,"spe_04_02","MaxHp_Mul","Self","None",1,false,"Buff","MaxHP_Mul","None","50%",0,0,0,"생명력"]
[81012,"spe_04_03","MaxHp_Mul","Self","None",1,false,"Buff","MaxHP_Mul","None","50%",0,0,0,"생명력"]
[81013,"spe_05_00","Burn","Enemy","Attack_Hit","100%",true,"Debuff","None","None","2s","-2%",0,0,"화상"]
[82013,"spe_05_01","MaxHp_Mul","Self","None",1,false,"Buff","MaxHP_Mul","None","15%","0","0","0","생명력"]
[81014,"spe_05_02","MaxHp_Mul","Self","None",1,false,"Buff","MaxHP_Mul","None","50%",0,0,0,"생명력"]
[82014,"spe_01_00","CriticalRate_Add","Self","None",1,false,"Buff","CriDmg","None","30%",0,0,0,"치명타 피해량"]
[81015,"spe_01_01","ATK_DMG_Mul","Self","None",1,false,"Buff","DmgMul","None","30%",0,0,0,"공격력"]
[82015,"spe_01_02","CriticalRate_Add","Self","None",1,false,"Buff","CriDmg","None","50%",0,0,0,"치명타 피해량"]
[81016,"spe_01_03","MaxShield_Mul","Self","None",1,false,"Buff","MaxShield_Mul","None","50%",0,0,0,"실드"]
[82016,"spe_03_00","CriticalRate_Add","Self","None",1,false,"Buff","CriDmg","None","30%",0,0,0,"치명타 피해량"]
[81017,"spe_03_02","MaxHp_Mul","Self","None",1,false,"Buff","MaxHP_Mul","None","50%",0,0,0,"생명력"]
[82017,"spe_04_00","CriticalRate_Add","Self","None",1,false,"Buff","CriDmg","None","30%",0,0,0,"치명타 피해량"]
[81018,"spe_04_01","MaxHp_Mul","Self","None",1,false,"Buff","MaxHP_Mul","None","50%",0,0,0,"생명력"]
[82018,"spe_04_02","ATK_DMG_Mul","Self","None",1,false,"Buff","DmgMul","None","25%",0,0,0,"공격력 25%"]
[81019,"spe_04_03","MaxHp_Mul","Self","None",1,false,"Buff","MaxHP_Mul","None","50%",0,0,0,"생명력"]
[82019,"spe_05_00","ATK_DMG_Mul","Self","None",1,false,"Buff","DmgMul","None","25%",0,0,0,"공격력 20%"]
[110001,null,"None","Self","None","100%",false,"Buff","Attack_Min","Attack_Max","1","2","1","0"]
[110002,null,"None","Self","None","100%",false,"Buff","Attack_Min","Attack_Max","2","3","1","1"]
[110003,null,"None","Self","None","100%",false,"Buff","Attack_Min","Attack_Max","3","4","1","2"]
[110004,null,"None","Self","None","100%",false,"Buff","Attack_Min","Attack_Max","4","5","1","3"]
[110005,null,"None","Self","None","100%",false,"Buff","Attack_Min","Attack_Max","5","6","1","4"]
[110006,null,"None","Self","None","100%",false,"Buff","Attack_Min","Attack_Max","6","7","1","5"]
[110101,null,"None","Self","None","100%",false,"Buff","MaxHP","None","5","0","1","0"]
[110201,null,"None","Self","None","100%",false,"Buff","MaxHP","None","6","0","1","0"]
[110301,null,"None","Self","None","100%",false,"Buff","MaxHP","None","7","0","1","0"]
[110401,null,"None","Self","None","100%",false,"Buff","MaxHP","None","8","0","1","0"]
[110501,null,"None","Self","None","100%",false,"Buff","MaxHP","None","9","0","1","0"]
[110601,null,"None","Self","None","100%",false,"Buff","GOLD_Mul","None","10%","0","1%","0"]
[110701,null,"None","Self","None","100%",false,"Buff","EXP_Mul","None","10%","0","2%","0"]
[120001,null,"None","Self","None","100%",false,"Buff","Cri","None","1%","0","0.1%","0"]
[120002,null,"None","Self","None","100%",false,"Buff","CriDmg","None","5%","0","0.5%","0"]
[120003,null,"None","Self","None","100%",false,"Buff","MaxShield","None","9","0","1","0"]
[120004,null,"None","Self","None","100%",false,"Buff","HitRate","None","10","0","1","0"]

{"sheet":"StatusConditionsList","index":27,"n_rows":78,"n_cols":10,"rows_kept":78,"cut":false,"hidden":false,"merged":[]}
["e_StatusConditionsType","e_StatusConditionsType_Old","s_SkillNoticeIcon","n_EffectNameDesc","n_EffectInfoDesc","s_SkillEffect","s_RepeatEffect","f_RepeatEffectStartDelay","e_EffectPivot"]
["_New Status Enum 타입","Old Status Enum 타입","Status 아이콘 정보","Status 효과의 이름","Status 효과의 설명","발생할 때 재생할 이펙트 경로","반복 재생할 이펙트 경로","반복 재생 될 이팩트 시작 될 시간","이펙트 표시 위치","설명"]
["Slow","Slow","Slow",13001,14001,"Fog_speedSlow",{"$f":"\"Repeat_\"&B3","v":"Repeat_Slow"},1,"Bottom","둔화"]
["Burn","Burn","Burn",13015,14015,"FX_Fire_Exp",{"$f":"\"Repeat_\"&B4","v":"Repeat_Burn"},1,"Center","화상"]
["Poison","Poison","Poison",13018,14018,"vfx_ToonHit_Bullet01Green","Fog_poison",1,"Center","중독"]
["Stun","Stun","Stun",13019,14019,"None","Stun_loop",1,"Top","스턴"]
["Freezing","Freezing","Freezing",13020,14020,{"$f":"\"Effect_\"&B7","v":"Effect_Freezing"},{"$f":"\"Repeat_\"&B7","v":"Repeat_Freezing"},1,"Center","빙결"]
["Blind","Blind","Blind",13021,14021,"HCFX_Eye_01",{"$f":"\"Repeat_\"&B8","v":"Repeat_Blind"},1,"Center","눈멀기"]
["Heal_Hp_Add","Heal","None",13005,14005,"Regeneration_health","None",1,"Bottom","HP 회복 : 고정(+)"]
["Heal_Shield_Add","Heal_Shield","None",0,0,"Loot_pick_up","None",1,"Center","실드 회복 : 고정(+)"]
["Heal_Hp_Random","New","None",0,0,"Loot_pick_up","None",1,"Center","HP 회복 : 고정 랜덤(+)"]
["Heal_Shield_Random","New","None",0,0,"Loot_pick_up","None",1,"Center","실드 회복 : 고정 랜덤(+)"]
["Heal_Hp_Mul","New","None",13005,14005,"Regeneration_health","None",1,"Bottom","HP 회복 : 비율(%)"]
["Heal_Shield_Mul","New","None",0,0,"Loot_pick_up","None",1,"Center","실드 회복 : 비율(%)"]
["Recovery_All","Heal_All","None",0,0,"Loot_pick_up","None",1,"Center","HP & 실드 완전 회복"]
["AddResurrection","AddResurrection","None",0,0,"Loot_pick_up","None",1,"Center","부활 횟수 추가"]
["VampirHeal_Add","VampirHeal_ADD","None",13006,14006,"Effect_Vampir","None",1,"Center","흡혈-고정 피해 : 고정(+)"]
["VampirHeal_Mul","VampirHeal_Rate","None",13007,14007,"Effect_Vampir","None",1,"Center","흡혈-비율 피해 : 비율(%)"]
["Invincibility_Count","DMG_IMMUNE","DMG_IMMUNE",13008,14008,{"$f":"\"Effect_\"&B19","v":"Effect_DMG_IMMUNE"},{"$f":"\"Repeat_\"&B19","v":"Repeat_DMG_IMMUNE"},1,"Center","무적 : 횟수"]
["Invincibility_Time","Invincibility","Invincibility",13016,14016,"FX_LightUpSmoke",{"$f":"\"Repeat_\"&B20","v":"Repeat_Invincibility"},1,"Center","무적 : 지속 시간"]
["Destruct","Self_destruct","None",13009,14009,"FX_Fire_Exp","None",1,"Center","자폭 : 무조건 자신"]
["Resurrection","Resurrection","None",13014,14014,"Loot_flicker","None",1,"Center","부활 : 무조건 자신"]
["Berserker_ATK_DMG_Add","Berserker_ATK_DMG","Berserker_ATK_DMG",13002,14002,"Loot_pick_up",{"$f":"\"Repeat_\"&B23","v":"Repeat_Berserker_ATK_DMG"},1,"Center","광포화-체력 기준, 공격력 증가 : 고정(+)"]
["Berserker_ATK_SPD_Add","Berserker_ATK_SPD","Berserker_ATK_SPD",13003,14003,"Fog_speedFast","Repeat_Berserker_ATK_SPD",1,"Center","광포화-체력 기준, 공속 증가 : 고정(+)"]
["Berserker_ATK_DMG_Mul","New","Berserker_ATK_DMG",13002,14002,"Loot_pick_up","Repeat_New",1,"Center","광포화-체력 비례 공격력 증가 : 비율(%)"]
["Berserker_ATK_SPD_Mul","New","Berserker_ATK_SPD",13003,14003,"Fog_speedFast","Repeat_New",1,"Center","광포화-체력 비례 공속 증가 : 비율(%)"]
["ATK_DMG_Add","ATK_UP","ATK_UP",13010,14010,"Loot_pick_up","Repeat_ATK_UP",1,"Center","강화-공격력 증가 : 고정(+)"]
["ATK_SPD_Add","ATK_SPD","ATK_SPD",13004,14004,"Fog_speedFast","Repeat_ATK_SPD",1,"Center","강화-공속 증가 : 고정(+)"]
["ATK_DMG_Mul","New","ATK_UP",13010,14010,"Loot_pick_up","Repeat_New",1,"Center","강화-공격력 증가 : 비율(%)"]
["ATK_SPD_Mul","New","ATK_SPD",13004,14004,"Fog_speedFast","Repeat_New",1,"Center","강화-공속 증가 : 비율(%)"]
["Death_ATK_Add","Death_ATK","Death_ATK",13011,14011,{"$f":"\"Effect_\"&B31","v":"Effect_Death_ATK"},{"$f":"\"Repeat_\"&B31","v":"Repeat_Death_ATK"},1,"Center","아군 사망 시 공격력 증가 : 고정(+)"]
["Death_ATK_Mul","New","Death_ATK",13011,14011,{"$f":"\"Effect_\"&B32","v":"Effect_New"},{"$f":"\"Repeat_\"&B32","v":"Repeat_New"},1,"Center","아군 사망 시 공격력 증가 : 비율(%)"]
["Death_Heal_Add","Death_Heal","None",13013,14013,"Area_generic_green_outbreak","None",1,"Center","아군 사망 시 회복 : 고정(+)"]
["Death_Heal_Mul","New","None",13013,14013,"Area_generic_green_outbreak","None",1,"Center","아군 사망 시 회복 : 비율(%)"]
["Death_Growup","Death_Growup","Death_Growup",13012,14012,{"$f":"\"Effect_\"&B35","v":"Effect_Death_Growup"},{"$f":"\"Repeat_\"&B35","v":"Repeat_Death_Growup"},1,"Center","아군 사망 시- 거대화 (크기 증가20% + 완전 회복, 아군 사망 시마다 공격력과 HP 최대치 2배씩 누적 증가)"]
["HitDamage_Add","New","None",0,0,"Loot_pick_up","None",1,"Center","피해가 발생되어 즉시 고정(-) HP 감소"]
["HitDamage_Random","New","None",0,0,"Loot_pick_up","None",1,"Center","피해가 발생되어 즉시 고정 랜덤 피해(-) HP 감소"]
["HitDamage_Mul","New","None",0,0,"Loot_pick_up","None",1,"Center","피해가 발생되어 즉시 최대 생명력의 HP 비율(%)만큼 감소"]
["IncreaseSoul_Mul","New","None",0,0,"Loot_pick_up","None",1,"Center","소울 획득량 증가"]
["IncreaseEXP_Mul","EXP_Mul","None",0,0,"Loot_pick_up","None",1,"Center","경험치 획득량 증가"]
["IncreaseGold_Mul","GOLD_mul","None",0,0,"Loot_pick_up","None",1,"Center","골드 획득량 증가"]
["GetSoul_Add","GetSoul","None",0,0,"Loot_pick_up","None",1,"Center","소울 획득 (즉시 증가)"]
["GetGold_Add","GetGold","None",0,0,"Loot_pick_up","None",1,"Center","골드 획득 (즉시 증가)"]
["GetExp_Add","GetExp","None",0,0,"Loot_pick_up","None",1,"Center","경험치 획득 (즉시 증가)"]
["GetPotion_Add","New","None",0,0,"Loot_pick_up","None",1,"Center","포션 획득 (즉시 수량 증가)"]
["GetSkillCard_N","GetSkillCard","None",0,0,"Loot_pick_up","None",1,"Center","일반(Common) 등급 카드 획득 (선택지 발생)"]
["GetSkillCard_R","New","None",0,0,"Loot_pick_up","None",1,"Center","고급UnCommon) 등급 카드 획득 (선택지 발생)"]
["GetSkillCard_SR","New","None",0,0,"Loot_pick_up","None",1,"Center","희귀(Rare) 등급 카드 획득 (선택지 발생)"]
["GetSkillCard_SSR","New","None",0,0,"Loot_pick_up","None",1,"Center","영웅(Epic) 등급 카드 획득 (선택지 발생)"]
["GetSkillCard_UR","New","None",0,0,"Loot_pick_up","None",1,"Center","전설(Legend) 등급 카드 획득 (선택지 발생)"]
["GetSkillCard_Random","New","None",0,0,"Loot_pick_up","None",1,"Center","일반~전설 등급 중 랜덤 카드 획득(등장 확률 = 등급 별 가중치)"]
["LvUp","LvUp","None",0,0,"Loot_pick_up","None",1,"Center","남은 경험치 무시하고 즉시 레벨업"]
["PC_DefaultAttack_Add","Rusy_NormalAttack","Rusy_NormalAttack",13024,14024,"None","None",1,"Center","영웅 기본 공격력에 최소 / 최대 공격력 고정(+) 수치 추가"]
["PC_MinAttack_Add","New","None",13024,14024,"None","None",1,"Center","영웅 기본 최소 공격력에 고정(+) 수치 증가"]
["PC_MaxAttack_Add","New","None",13024,14024,"None","None",1,"Center","영웅 기본 최대 공격력 고정(+) 수치 증가"]
["PC_DefaultAttack_Mul","New","None",13024,14024,"None","None",1,"Center","영웅 기본 공격력을 기준으로 최소 / 최대 공격력 비율(%) 증가"]
["PC_MinAttack_Mul","New","None",13024,14024,"None","None",1,"Center","영웅 기본 최소 공격력을 기준으로 비율(%) 증가"]
["PC_MaxAttack_Mul","New","None",13024,14024,"None","None",1,"Center","영웅 기본 최대 공격력을 기준으로 비율(%) 증가"]
["PC_Evasion_Melee","Rusy_Evasion","Rusy_Evasion",13025,14025,"None","None",1,"Center","영웅 근접 회피 확률에 고정(+) 확률을 추가"]
["PC_Evasion_Range","New","Rusy_Evasion",13025,14025,"None","None",1,"Center","영웅 원거리 회피 확률에 고정(+) 확률을 추가"]
["PC_Evasion_All","New","Rusy_Evasion",13025,14025,"None","None",1,"Center","영웅 근접 / 원거리 회피 확률에 고정(+) 확률을 각각 추가"]
["PC_Critical_Add","New","None",13026,14026,"None","None",1,"Center","영웅 기본 치명타 확률에 고정(+) 확률 값을 추가"]
["PC_CriticalRate_Add","Rusy_CriticalRate","Rusy_CriticalRate",13027,14027,"None","None",1,"Center","치명타 피해량 증가"]
["HitCriticalRate_Add","Rusy_HitCritical","Rusy_HitCritical",13026,14026,"None","None",1,"Center","공격 명중 시마다 영웅 기본 치명타 피해량에 고정(+) 확률 값을 추가(치명타 발생 시 초기화)"]
["PC_Accuracy_Add","New","None",13026,14026,"None","None",1,"Center","영웅 기본 명중력에 고정(+) 값을 추가"]
["PC_StealRate_Add","New","None",13026,14026,"None","None",1,"Center","영웅 기본 훔치기 확률에 고정(+) 확률을 추가"]
["PC_IncreaseMaxHp_Add","New","None",13024,14024,"None","None",1,"Center","영웅의 최대 생명력에 고정(+) 값만큼 최대 생명력 추가"]
["PC_IncreaseMaxHp_Mul","New","None",13024,14024,"None","None",1,"Center","영웅의 최대 생명력을 기준으로 비율(%) 만큼 최대 생명력 증가"]
["PC_IncreaseMaxShield_Add","New","None",13024,14024,"None","None",1,"Center","영웅의 최대 보호막에 고정(+) 값만 큼 최대 보호막을 추가"]
["PC_IncreaseMaxShield_Mul","New","None",13024,14024,"None","None",1,"Center","영웅의 최대 보호막을 기준으로 비율(%) 만큼 최대 보호막 증가"]
["Battle","New","None",13024,14024,"None","None",1,"Center","즉시 지정 된 몬스터 등장 후 전투 발생(선제 공격)"]
["Cri_Add","New","None",13015,14015,"None","None",1,"Center","치명타 확률 증가"]
["CriticalRate_Add","New","None",13015,14015,"None","None",1,"Center","치명타 피해량 증가"]
["MaxHp_Mul","New","None",13015,14015,"None","None",1,"Center","최대 HP 증가"]
["MaxShield_Mul","New","None",13015,14015,"None","None",1,"Center","최대 보호막 증가"]
["Curse","New","None",13015,14015,"Effect_Curse","Effect_Curse",0.5,"Center","저주 효과"]
["Curse_Explosion","New","None",13015,14015,"Effect_Curse_Exp","None",0,"Center","저주 효과 폭발 이펙트"]
["Evasion_All","New","None",13015,14015,"None","None",1,"Center","회피력 증가(몬스터에 주로 사용)"]

{"sheet":"Projectile","index":28,"n_rows":192,"n_cols":20,"rows_kept":192,"cut":false,"hidden":false,"merged":[]}
["s_Projectile","n_LoadAmount","f_Scale","s_Effect","f_PositionX","f_PositionY","b_Filpx"]
["_투사체 프리팹","미리 생성 개수","크기","적중 시 나올 이펙트","보정 X좌표","보정 Y좌표","x축 반전"]
["2D Projectile 27 heart",5,3,"HCFX_Heart_Get",0,0,false]
["Projectile 8 energy",5,2,"Vol2_Hit 8",0,0,false]
["Projectile 20 black",5,2,"Vol2_Hit 20",0,0,false]
["vfx_Projectile_Orb02_Pink",5,1.5,"vfx_Hit_Orb02_Pink",0,0,false]
["vfx_Projectile_Orb06_Purple",5,1.5,"vfx_Hit_Orb06_Purple",0,0,false]
["vfx_Projectile_Orb05_Purple",5,1.5,"vfx_Hit_Orb05_Purple",0,0,false]
["vfx_Projectile_Orb04_Yellow",5,1.5,"vfx_Hit_Orb04_Yellow",0,0,false]
["vfx_Projectile_Fireball03_Orange",5,1,"vfx_Hit_Fireball03_Orange",0,0,false,null,null,null,null,10001,"거미여왕1","UniqueToonProjectiles01_Demo","vfx_ToonProjectile_Fireball01Green",null,null,"AAA Projectiles Vol 1","2D Projectile 27 heart","2D Projectile 27 heart"]
["vfx_Projectile_Fireball03_Green",5,1,"vfx_Hit_Fireball03_Green",0,0,false,null,null,null,null,10002,"거미여왕2","UniqueToonProjectiles01_Demo","vfx_ToonProjectile_Fireball01Purple",null,null,"AAA Projectiles Vol 1","FLASH_4","Projectile 4 yellow arrow"]
["vfx_Projectile_Orb09_OrangePurple",5,1.5,"vfx_Hit_Orb09_OrangePurple",0,0,false,null,null,null,null,10003,"놀강도2",null,null,null,null,"AAA Projectiles Vol 1","2D Projectile 21 red arrow","2D Projectile 21 red arrow"]
["vfx_Projectile_Orb09_BluePurple",5,1.5,"vfx_Hit_Orb09_BluePurple",0,0,false,null,null,null,null,10004,"놀아처1","AAA Projectiles Vol 2","Projectile 12 cuts",null,null,"AAA Projectiles Vol 1","FLASH 21 red arrow","Projectile 21 red arrow"]
["vfx_Projectile_Orb13_DarkPurple",5,1.5,"vfx_Hit_Orb13_DarkPurple",0,0,false,null,null,null,null,10005,"늑대인간",null,null,null,null,"AAA Projectiles Vol 1","Flash 3 black fire","Projectile 3 black fire"]
["vfx_Projectile_Orb13_DarkRed",5,1.5,"vfx_Hit_Orb13_DarkRed",0,0,false,null,null,null,null,10006,"다크엘프 아처1","AAA Projectiles Vol 2","Projectile 7 wind",null,null,"AAA Projectiles Vol 1","Flash 6 blue fire","Projectile 6 blue fire"]
["vfx_Projectile_Orb14_Red",5,1.5,"vfx_Hit_Orb14_Red",0,0,false,null,null,null,null,10007,"대사탄1",null,null,null,null,"AAA Projectiles Vol 1","Flash 16 fire","Projectile 16 fire"]
["vfx_Projectile_Orb15_DarkBlue",5,1.25,"vfx_Hit_Orb15_DarkBlue",0,0,false,null,null,null,null,10008,"대사탄2",null,null,null,null,"AAA Projectiles Vol 2","FLASH_12","Projectile 12 cuts"]
["vfx_Projectile_Orb15_DarkRed",5,1.25,"vfx_Hit_Orb15_DarkRed",0,0,false,null,null,null,null,10009,"데스나이트1",null,null,null,null,"AAA Projectiles Vol 2","FLASH_7","Projectile 7 wind"]
["vfx_Projectile_Orb15_DarkOrange",5,1.25,"vfx_Hit_Orb15_DarkOrange",0,0,false,null,null,null,null,10010,"데스나이트3",null,null,null,null,"AAA Projectiles Vol 2","FLASH_19","Projectile 19 sun"]
["vfx_ToonProjectile_Fireball01Green",5,1,"vfx_ToonHit_Fireball01Green",0,0,false,null,null,null,null,10011,"레드드래곤1",null,null,null,null,"AAA Projectiles Vol 2","FLASH_8","Projectile 8 energy"]
["vfx_ToonProjectile_Fireball01Purple",5,1,"vfx_ToonHit_Fireball01Purple",0,0,false,null,null,null,null,10012,"레드드래곤3",null,null,null,null,"AAA Projectiles Vol 2","FLASH_20","Projectile 20 black"]
["vfx_ToonProjectile_Bomb02Red",5,1,"vfx_ToonHit_Bomb02Red",0,0,false,null,null,null,null,10013,"레드드래곤4","UniqueToonProjectiles01_Demo","vfx_ToonProjectile_Bomb02Red",null,null,"AAA Projectiles Vol 2","Flash 4","Projectile 4 fire"]
["vfx_ToonProjectile_Plasma03Purple",5,1,"vfx_ToonHit_Plasma03Purple",0,0,false,null,null,null,null,10014,"메두사1",null,null,null,null,"UniqueProjectiles02_Demo","vfx_Projectile_Orb02_Pink","vfx_Projectile_Orb02_Pink"]
["vfx_ToonProjectile_Bomb03Orange",5,1.25,"vfx_ToonHit_Bomb03Orange",0,0,false,null,null,null,null,10015,"메두사2","UniqueToonProjectiles01_Demo","vfx_ToonProjectile_Plasma03Purple",null,null,"UniqueProjectiles02_Demo","vfx_Projectile_Orb06_Purple","vfx_Projectile_Orb06_Purple"]
["vfx_ToonProjectile_Bomb03Red",5,1.5,"vfx_ToonHit_Bomb03Red",0,0,false,null,null,null,null,10016,"바포메트2","AAA Projectiles Vol 2","Projectile 19 sun",null,null,"UniqueProjectiles02_Demo","vfx_Projectile_Orb05_Purple","vfx_Projectile_Orb05_Purple"]
["vfx_ToonProjectile_Bomb03Blue",5,1.5,"vfx_ToonHit_Bomb03Blue",0,0,false,null,null,null,null,10017,"바포메트6","AAA Projectiles Vol 2","Projectile 8 emergy",null,null,"UniqueProjectiles02_Demo","vfx_Projectile_Orb04_Yellow","vfx_Projectile_Orb04_Yellow"]
["vfx_ToonProjectile_Bullet01Green",5,1.25,"vfx_ToonHit_Bullet01Green",0,0,false,null,null,null,null,10018,"바포메트7","AAA Projectiles Vol 2","Projectile 20 black",null,null,"UniqueProjectiles02_Demo","vfx_Projectile_Fireball03_Orange","vfx_Projectile_Fireball03_Orange"]
["YellowSwordBeamHit",1,1,null,0,0,false,null,null,null,null,10019,"에티4",null,null,null,null,"UniqueProjectiles02_Demo","vfx_Projectile_Fireball03_Green","vfx_Projectile_Fireball03_Green"]
["Attack_Stun",5,1,"Stun_loop",0,0,false,"HCFX_Hit_01",null,null,null,10020,"오우거1",null,null,null,null,"UniqueProjectiles03_Demo","vfx_Projectile_Orb09_OrangePurple","vfx_Projectile_Orb09_OrangePurple"]
["FX_Cartoon Thunder",2,1.5,null,0,0,false,null,null,null,null,10021,"용암골렘2",null,null,null,null,"UniqueProjectiles03_Demo","vfx_Projectile_Orb09_BluePurple","vfx_Projectile_Orb09_BluePurple"]
["FX_BlueCharge",5,1,null,0,0,false,null,null,null,null,10022,"임프전사1",null,null,null,null,"UniqueProjectiles03_Demo","vfx_Projectile_Fireball07_Blue","vfx_Projectile_Fireball07_Blue"]
["FX_Red Slash_Impact",5,1,null,0,0,false,null,null,null,null,10023,"타락한 천사",null,null,null,null,"UniqueProjectiles03_Demo","vfx_Projectile_Fireball07_Orange","vfx_Projectile_Fireball07_Orange"]
["Holy hit",5,1,null,0,0,false,null,"신성 피해",null,null,10024,"트롤 워리어4",null,null,null,null,"UniqueProjectiles03_Demo","vfx_Projectile_Fireball07_Purple","vfx_Projectile_Fireball07_Purple"]
["EnergyBlast",5,1,null,0,0,false,null,"버프 이펙트",null,null,10025,"흑기사1",null,null,null,null,"UniqueProjectiles03_Demo","vfx_Projectile_Orb13_DarkPurple","vfx_Projectile_Orb13_DarkPurple"]
["FX_Fireball_Fall",5,2,null,0,0,false,null,null,null,null,10026,"흑기사2",null,null,null,null,"UniqueProjectiles03_Demo","vfx_Projectile_Orb13_DarkRed","vfx_Projectile_Orb13_DarkRed"]
["BlueCannonBullet",5,2,"BlueCannonHit",0,0,false,null,null,null,null,10027,"흑기사3",null,null,null,null,"UniqueProjectiles03_Demo","vfx_Projectile_Orb14_Yellow","vfx_Projectile_Orb14_Yellow"]
["Magic Door_Purple",5,0.6,"FX_Purple_Hit",0,0,false,null,null,null,null,10028,"흡혈귀여왕2","AAA Projectiles Vol 1","2D Projectile 27 heart",null,null,"UniqueProjectiles03_Demo","vfx_Projectile_Orb14_Red","vfx_Projectile_Orb14_Red"]
["MeleeAttack",5,1.25,null,0,0,false,"HCFX_Hit_08",null,null,null,11001,"놀1",null,null,null,null,"UniqueProjectiles03_Demo","vfx_Projectile_Orb15_DarkBlue","vfx_Projectile_Orb15_DarkBlue"]
["G1_IllusionSpearAttack",2,2,null,0,0,false,null,null,null,null,11002,"놀2",null,null,null,null,"UniqueProjectiles03_Demo","vfx_Projectile_Orb15_DarkRed","vfx_Projectile_Orb15_DarkRed"]
["magicmissile",6,3,"YellowMachineGunHit",0,0,false,null,null,null,null,11003,"놀3",null,null,null,null,"UniqueProjectiles03_Demo","vfx_Projectile_Orb15_DarkOrange","vfx_Projectile_Orb15_DarkOrange"]
["darkmissile",10,3,"YellowMachineGunHit",0,0,false,null,"중독 이펙트?",null,null,11004,"놀강도1",null,null,null,null,"UniqueProjectiles03_Demo","vfx_Projectile_Orb07_Purple","vfx_Projectile_Orb07_Purple"]
["G4_NHitCastsLightningAttack",2,0.5,"FX_Thunder Smoke",0,0,false,null,null,null,null,11005,"놀강도3",null,null,null,null,"UniqueToonProjectiles01_Demo","vfx_ToonProjectile_Fireball01Green","vfx_ToonProjectile_Fireball01Green"]
["FX_Shoot_06_projectile",5,1.25,"FX_Shoot_06_muzzle",0,0,false,null,null,null,null,11006,"놀강도4",null,null,null,null,"UniqueToonProjectiles01_Demo","vfx_ToonProjectile_Fireball01Purple","vfx_ToonProjectile_Fireball01Purple"]
["FX_Icelight_Seal",5,1,null,0,0,false,null,null,null,null,11007,"놀아처2","AAA Projectiles Vol 2","Projectile 12 cuts",null,null,"UniqueToonProjectiles01_Demo","vfx_ToonProjectile_Bomb02Red","vfx_ToonProjectile_Bomb02Red"]
["vfx_Heal",5,1,"Effect_Heal",0,0,false,"FX_SpeedUP",null,null,null,11008,"놀아처3","AAA Projectiles Vol 1","Projectile 4 yellow arrow",null,null,"UniqueToonProjectiles01_Demo","vfx_ToonProjectile_Plasma03Purple","vfx_ToonProjectile_Plasma03Purple"]
["FX_Rotating shield",5,1,null,0,0,false,null,null,null,null,11009,"미노타우르스 광전사1",null,null,null,null,"UniqueToonProjectiles01_Demo","vfx_ToonProjectile_Bomb03Orange","vfx_ToonProjectile_Bomb03Orange"]
["FX_Shoot_02_projectile",5,1,"vfx_ToonHit_Bomb03Blue",0,0,false,null,null,null,null,11010,"미노타우르스 광전사2",null,null,null,null,"UniqueToonProjectiles01_Demo","vfx_ToonProjectile_Bomb03Red","vfx_ToonProjectile_Bomb03Red"]
["FX_Shoot_08_projectile",5,1,"FX_Shoot_08_muzzle",0,0,false,null,null,null,null,11011,"미노타우르스 광전사3",null,null,null,null,"UniqueToonProjectiles01_Demo","vfx_ToonProjectile_Bomb03Blue","vfx_ToonProjectile_Bomb03Blue"]
["Projectiles_dark_magic",5,1,"Hit_dark_magic",0,0,false,null,null,null,null,11012,"미노타우르스 광전사4",null,null,null,null,"UniqueToonProjectiles01_Demo","vfx_ToonProjectile_Bullet01Green","vfx_ToonProjectile_Bullet01Green"]
["Projectiles_electric",5,1,"Hit_electric",0,0,false,null,null,null,null,11013,"미노타우로스 도살자1"]
["Projectiles_fire",5,1,"Hit_fire",0,0,false,null,null,null,null,11014,"미노타우로스 도살자2"]
["Projectiles_frost",5,1,"Hit_frost",0,0,false,null,null,null,null,11015,"미노타우르스 챔피언1"]
["Projectiles_green_shuriken",5,1,"Hit_green_shuriken",0,0,false,null,null,null,null,11016,"미노타우르스 챔피언2"]
["Projectiles_heart",5,1,"Hit_heart",0,0,false,null,null,null,null,11017,"미노타우르스 챔피언3"]
["Projectiles_light",5,1,"Heavy 2  -  Yellow",0,0,false,"Hit_light",null,null,null,11018,"미노타우르스 챔피언4"]
["Projectiles_magic",5,1,"Hit_magic",0,0,false,null,null,null,null,11019,"미노타우르스 챔피언5"]
["Projectiles_water",5,1,"Hit_water",0,0,false,null,null,null,null,11020,"버그베어1"]
["Projectiles_wind",5,1,"Hit_wind",0,0,false,null,null,null,null,11021,"버그베어2"]
["2D Projectile 4 yellow arrow",5,1,"Heavy 2  -  Yellow",0,0,false,null,null,null,null,11022,"버그베어3"]
["MeleeAttack_Axe",5,0.7,"FX_Blood_Hit_03",-1.8,-0.5,true,"Orange_Slash_2","YellowMachineGunHit",null,null,11023,"버그베어4"]
["MeleeAttack_Sword",5,0.8,"SlashHitBlue",-3,0,true,"Blue_Slash_3","FX_Shoot_06_muzzle",null,null,11024,"싸이클롭스1","UniqueToonProjectiles01_Demo","vfx_ToonProjectile_Bomb03Orang"]
["MeleeAttack_Dagger",5,0.7,"SlashHitComplex",-2.5,0.5,true,"Orange_Slash_1",null,null,null,11025,"싸이클롭스2","UniqueToonProjectiles01_Demo","vfx_ToonProjectile_Bomb03Red"]
["MeleeAttack_Blunt",5,1.2,"FX_Yellow_Hit",-3,-0.5,true,"Blue_Slash_4",null,null,null,11026,"싸이클롭스3","UniqueToonProjectiles01_Demo","vfx_ToonProjectile_Bomb03Blue"]
["MeleeAttack_Claw",5,0.7,"FX_Red_2Hit",1.5,0,false,null,"FX_BloodSlash_Five",null,null,11027,"예티1"]
["MeleeAttack_Scythe",5,1.2,"ArrowHit",-4.2,0,true,"FX_Double RedSlash",null,null,null,11028,"예티2"]
["MeleeAttack_DoubleSword",5,0.8,"FX_Water Splash_4Hit",-1.5,0,false,"HCFX_Hit_09",null,null,null,11029,"트롤1"]
["MeleeAttack_Blow",1,0.8,"FX_Yellow_Hit",-2,-1,true,"FX_Slash_Ground2",null,null,null,11030,"트롤2"]
["FX_Double Claw",5,1.2,"FX_YellowSlash_Hit",-1,0,true,null,null,null,null,11031,"트롤3"]
["FX_Shield_Ring",5,1,null,0,0,false,null,null,null,null,12001,"강도1"]
["Bite  -  Blue",5,2.2000000000000002,"HCFX_Hit_03",0,0,false,null,null,null,null,12002,"강도2"]
["Bite  -  Red",5,2.2000000000000002,"LevelUp2",0,0,false,null,null,null,null,12003,"강도3"]
["Bite  -  White",5,2.2000000000000002,"FX_Purple_Hit",0,0,false,null,null,null,null,12004,"고블린1"]
["Bite  -  Yellow",5,2.2000000000000002,"FX_BloodSlash_Five",0,0,false,null,null,null,null,12005,"고블린 라이더1"]
["FX_Kick",5,1,"Light 2  -  Yellow",-3.8,0,true,null,null,null,null,12006,"고블린 라이더2"]
["DeathAttack",1,1,"DeathAttack_Hit",0,0,false,null,null,null,null,12007,"고블린 아처1","UniqueToonProjectiles01_Demo","vfx_ToonProjectile_Bullet01Green"]
[null,null,null,null,null,null,null,null,null,null,null,12008,"광전사1"]
[null,null,null,null,null,null,null,null,null,null,null,12009,"광전사2"]
[null,null,null,null,null,null,null,null,null,null,null,12010,"광전사3"]
[null,null,null,null,null,null,null,null,null,null,null,12011,"광전사4"]
[null,null,null,null,null,null,null,null,null,null,null,12012,"광전사5"]
[null,null,null,null,null,null,null,null,null,null,null,12013,"광전사6"]
[null,null,null,null,null,null,null,null,null,null,null,12014,"다크엘프 기사2"]
[null,null,null,null,null,null,null,null,null,null,null,12015,"다크엘프 기사3"]
[null,null,null,null,null,null,null,null,null,null,null,12016,"다크엘프 기사4"]
[null,null,null,null,null,null,null,null,null,null,null,12017,"다크엘프 마법사1","UniqueProjectiles02_Demo","vfx_Projectile_Orb02_Pink"]
[null,null,null,null,null,null,null,null,null,null,null,12018,"다크엘프 마법사3","UniqueProjectiles02_Demo","vfx_Projectile_Orb06_Purple"]
[null,null,null,null,null,null,null,null,null,null,null,12019,"다크엘프 마법사4","UniqueProjectiles02_Demo","vfx_Projectile_Orb05_Purple"]
[null,null,null,null,null,null,null,null,null,null,null,12020,"도살자1"]
[null,null,null,null,null,null,null,null,null,null,null,12021,"도살자2"]
[null,null,null,null,null,null,null,null,null,null,null,12022,"살인 청부업자1"]
[null,null,null,null,null,null,null,null,null,null,null,12023,"살인 청부업자2"]
[null,null,null,null,null,null,null,null,null,null,null,12024,"살인 청부업자3"]
[null,null,null,null,null,null,null,null,null,null,null,12025,"연쇄살인마1"]
[null,null,null,null,null,null,null,null,null,null,null,12026,"연쇄살인마2"]
[null,null,null,null,null,null,null,null,null,null,null,12027,"연쇄살인마3"]
[null,null,null,null,null,null,null,null,null,null,null,12028,"오크 궁수1","AAA Projectiles Vol 2","Projectile 12 cuts"]
[null,null,null,null,null,null,null,null,null,null,null,12029,"오크 궁수2","AAA Projectiles Vol 1","2D Projectile 21 red arrow"]
[null,null,null,null,null,null,null,null,null,null,null,12030,"오크 마법사1","UniqueProjectiles03_Demo","vfx_Projectile_Orb09_OrangePurple"]
[null,null,null,null,null,null,null,null,null,null,null,12031,"오크 마법사2","UniqueProjectiles03_Demo","vfx_Projectile_Orb09_BluePurple"]
[null,null,null,null,null,null,null,null,null,null,null,12032,"오크1"]
[null,null,null,null,null,null,null,null,null,null,null,12033,"오크2"]
[null,null,null,null,null,null,null,null,null,null,null,12034,"오크 워리어1"]
[null,null,null,null,null,null,null,null,null,null,null,12035,"활든 강도1","AAA Projectiles Vol 1","Projectile 21 red arrow"]
[null,null,null,null,null,null,null,null,null,null,null,12036,"활든 강도2","AAA Projectiles Vol 2","Projectile 12 cuts"]
[null,null,null,null,null,null,null,null,null,null,null,12037,"활든 강도3","AAA Projectiles Vol 1","Projectile 4 yellow arrow"]
[null,null,null,null,null,null,null,null,null,null,null,13001,"네크로멘서1","UniqueProjectiles03_Demo","vfx_Projectile_Fireball07_Blue"]
[null,null,null,null,null,null,null,null,null,null,null,13002,"네크로멘서2","UniqueProjectiles03_Demo","vfx_Projectile_Fireball07_Orange"]
[null,null,null,null,null,null,null,null,null,null,null,13003,"네크로멘서3","UniqueProjectiles03_Demo","vfx_Projectile_Fireball07_Purple"]
[null,null,null,null,null,null,null,null,null,null,null,13004,"데스1"]
[null,null,null,null,null,null,null,null,null,null,null,13005,"데스2"]
[null,null,null,null,null,null,null,null,null,null,null,13006,"데스나이트2"]
[null,null,null,null,null,null,null,null,null,null,null,13007,"머미1"]
[null,null,null,null,null,null,null,null,null,null,null,13008,"머미2"]
[null,null,null,null,null,null,null,null,null,null,null,13009,"머미3"]
[null,null,null,null,null,null,null,null,null,null,null,13010,"바포메트1","UniqueProjectiles03_Demo","vfx_Projectile_Orb13_DarkPurple"]
[null,null,null,null,null,null,null,null,null,null,null,13011,"바포메트3","UniqueProjectiles03_Demo","vfx_Projectile_Orb13_DarkRed"]
[null,null,null,null,null,null,null,null,null,null,null,13012,"바포메트4","UniqueProjectiles03_Demo","vfx_Projectile_Orb14_Yellow"]
[null,null,null,null,null,null,null,null,null,null,null,13013,"바포메트5","UniqueProjectiles03_Demo","vfx_Projectile_Orb14_Red"]
[null,null,null,null,null,null,null,null,null,null,null,13014,"사악한 악령1"]
[null,null,null,null,null,null,null,null,null,null,null,13015,"사악한 악령2"]
[null,null,null,null,null,null,null,null,null,null,null,13016,"악마 광신자1","UniqueProjectiles03_Demo","vfx_Projectile_Orb15_DarkBlue"]
[null,null,null,null,null,null,null,null,null,null,null,13017,"악마 광신자2","UniqueProjectiles03_Demo","vfx_Projectile_Orb15_DarkRed"]
[null,null,null,null,null,null,null,null,null,null,null,13018,"악마 광신자3","UniqueProjectiles03_Demo","vfx_Projectile_Orb15_DarkOrange"]
[null,null,null,null,null,null,null,null,null,null,null,13019,"악마 광신자4","UniqueProjectiles03_Demo","vfx_Projectile_Orb07_Purple"]
[null,null,null,null,null,null,null,null,null,null,null,13020,"악마 추종자1"]
[null,null,null,null,null,null,null,null,null,null,null,13021,"악마 추종자2"]
[null,null,null,null,null,null,null,null,null,null,null,13022,"악마 추종자3"]
[null,null,null,null,null,null,null,null,null,null,null,13023,"임프 사역마1"]
[null,null,null,null,null,null,null,null,null,null,null,13024,"임프 사역마2"]
[null,null,null,null,null,null,null,null,null,null,null,13025,"타락한 기사1"]
[null,null,null,null,null,null,null,null,null,null,null,13026,"타락한 기사2"]
[null,null,null,null,null,null,null,null,null,null,null,13027,"타락한 기사3"]
[null,null,null,null,null,null,null,null,null,null,null,13028,"해골 궁수","AAA Projectiles Vol 1","Projectile 4 yellow arrow"]
[null,null,null,null,null,null,null,null,null,null,null,13029,"해골 근위병"]
[null,null,null,null,null,null,null,null,null,null,null,13030,"해골 법사","UniqueProjectiles02_Demo","vfx_Projectile_Orb04_Yellow"]
[null,null,null,null,null,null,null,null,null,null,null,13031,"해골 기사1"]
[null,null,null,null,null,null,null,null,null,null,null,13032,"해골 기사2"]
[null,null,null,null,null,null,null,null,null,null,null,13033,"해골 기사3"]
[null,null,null,null,null,null,null,null,null,null,null,13034,"해골 기사4"]
[null,null,null,null,null,null,null,null,null,null,null,14001,"펑거스"]
[null,null,null,null,null,null,null,null,null,null,null,14002,"동굴 박쥐"]
[null,null,null,null,null,null,null,null,null,null,null,14003,"만드레고라"]
[null,null,null,null,null,null,null,null,null,null,null,14004,"켄타우로스"]
[null,null,null,null,null,null,null,null,null,null,null,14005,"무리안"]
[null,null,null,null,null,null,null,null,null,null,null,14006,"타이가"]
[null,null,null,null,null,null,null,null,null,null,null,14007,"구울1"]
[null,null,null,null,null,null,null,null,null,null,null,14008,"구울2"]
[null,null,null,null,null,null,null,null,null,null,null,14009,"구울3"]
[null,null,null,null,null,null,null,null,null,null,null,14010,"다이어울프1"]
[null,null,null,null,null,null,null,null,null,null,null,14011,"다이어울프2"]
[null,null,null,null,null,null,null,null,null,null,null,14012,"데스웜"]
[null,null,null,null,null,null,null,null,null,null,null,14013,"동굴쥐1"]
[null,null,null,null,null,null,null,null,null,null,null,14014,"동굴쥐2"]
[null,null,null,null,null,null,null,null,null,null,null,14015,"리자드맨"]
[null,null,null,null,null,null,null,null,null,null,null,14016,"맹독사1"]
[null,null,null,null,null,null,null,null,null,null,null,14017,"맹독사2"]
[null,null,null,null,null,null,null,null,null,null,null,14018,"미믹"]
[null,null,null,null,null,null,null,null,null,null,null,14019,"셀로브"]
[null,null,null,null,null,null,null,null,null,null,null,14020,"스프리트"]
[null,null,null,null,null,null,null,null,null,null,null,14021,"슬라임1"]
[null,null,null,null,null,null,null,null,null,null,null,14022,"슬라임2"]
[null,null,null,null,null,null,null,null,null,null,null,14023,"임프1"]
[null,null,null,null,null,null,null,null,null,null,null,14024,"임프2"]
[null,null,null,null,null,null,null,null,null,null,null,14025,"임프3"]
[null,null,null,null,null,null,null,null,null,null,null,14026,"임프4"]
[null,null,null,null,null,null,null,null,null,null,null,14027,"임프 마법사1","AAA Projectiles Vol 1","Projectile 3 black fire"]
[null,null,null,null,null,null,null,null,null,null,null,14028,"임프 마법사2","AAA Projectiles Vol 1","Projectile 6 blue fire"]
[null,null,null,null,null,null,null,null,null,null,null,14029,"임프 마법사3","AAA Projectiles Vol 1","Projectile 16 fire"]
[null,null,null,null,null,null,null,null,null,null,null,14030,"임프 마법사4","AAA Projectiles Vol 2","Projectile 4 fire"]
[null,null,null,null,null,null,null,null,null,null,null,14031,"임프 전사2"]
[null,null,null,null,null,null,null,null,null,null,null,14032,"임프 전사3"]
[null,null,null,null,null,null,null,null,null,null,null,14033,"하피"]
[null,null,null,null,null,null,null,null,null,null,null,14034,"흡혈귀1"]
[null,null,null,null,null,null,null,null,null,null,null,15001,"싸이 전사"]
[null,null,null,null,null,null,null,null,null,null,null,15002,"레드드래곤1","UniqueProjectiles02_Demo","vfx_Projectile_Fireball03_Orange"]
[null,null,null,null,null,null,null,null,null,null,null,15003,"레드드래곤2","UniqueProjectiles02_Demo","vfx_Projectile_Fireball03_Green"]
[null,null,null,null,null,null,null,null,null,null,null,15004,"약탈꾼1"]
[null,null,null,null,null,null,null,null,null,null,null,15005,"약탈꾼2"]
[null,null,null,null,null,null,null,null,null,null,null,15006,"예티1"]
[null,null,null,null,null,null,null,null,null,null,null,15007,"예티2"]
[null,null,null,null,null,null,null,null,null,null,null,15008,"예티3"]
[null,null,null,null,null,null,null,null,null,null,null,15009,"예티5"]
[null,null,null,null,null,null,null,null,null,null,null,15010,"예티6"]
[null,null,null,null,null,null,null,null,null,null,null,15011,"오우거2"]
[null,null,null,null,null,null,null,null,null,null,null,15012,"오우거3"]
[null,null,null,null,null,null,null,null,null,null,null,15013,"용암골렘1"]
[null,null,null,null,null,null,null,null,null,null,null,15014,"트롤 워리어1"]
[null,null,null,null,null,null,null,null,null,null,null,15015,"트롤 워리어2"]
[null,null,null,null,null,null,null,null,null,null,null,15016,"트롤 워리어3"]
[null,null,null,null,null,null,null,null,null,null,null,15017,"트롤 워리어5"]
[null,null,null,null,null,null,null,null,null,null,null,15018,"트롤 워리어6"]
[null,null,null,null,null,null,null,null,null,null,null,15019,"트롤 워리어7"]

{"sheet":"Effect","index":29,"n_rows":95,"n_cols":14,"rows_kept":95,"cut":false,"hidden":false,"merged":[]}
["s_Effect","n_LoadAmount","f_Scale","f_EffectDelay","f_PositionX","f_PositionY"]
["_이펙트 프리팹","미리 생성 개수","크기","이펙트 지연 시간","보정 X좌표","보정 Y좌표"]
["Effect_Vampir",5,3,0,0,0]
["Effect_Freezing",5,1.25,0,0,0]
["Effect_Blind",5,2,0,0,0,"저주"]
["Effect_Burn",5,1.25,0,0,0]
["Effect_Heal",5,1.6,0.2,0,0]
["YellowMachineGunHit",6,5,0,0,0]
["Hit 27 heart",2,2.5,0,0,0]
["Vol2_Hit 4",2,1.5,0,0,0]
["Vol2_Hit 8",2,1.5,0,0,0]
["Vol2_Hit 20",2,2,0,0,0]
["vfx_Hit_Orb02_Pink",2,1.5,0,0,0]
["vfx_Hit_Orb06_Purple",2,1.5,0,0,0]
["vfx_Hit_Orb05_Purple",2,1.5,0,0,0]
["vfx_Hit_Orb04_Yellow",2,1.5,0,0,0]
["vfx_Hit_Fireball03_Orange",2,1.5,0,0,0]
["vfx_Hit_Fireball03_Green",2,1.5,0,0,0]
["vfx_Hit_Orb09_OrangePurple",2,1.5,0,0,0]
["vfx_Hit_Orb09_BluePurple",2,1.5,0,0,0]
["vfx_Hit_Orb13_DarkPurple",2,1.5,0,0,0]
["vfx_Hit_Orb13_DarkRed",2,1.5,0,0,0]
["vfx_Hit_Orb14_Red",2,1.5,0,0,0]
["vfx_Hit_Orb15_DarkBlue",2,1.5,0,0,0]
["vfx_Hit_Orb15_DarkRed",2,1.5,0,0,0]
["vfx_Hit_Orb15_DarkOrange",2,1.5,0,0,0]
["vfx_ToonHit_Fireball01Green",2,1.25,0,0,0,null,null,null,null,null,null,null,"vfx_ToonHit_Bullet01Green"]
["vfx_ToonHit_Fireball01Purple",2,1.25,0,0,0,null,null,null,null,null,null,null,"vfx_Hit_Orb15_DarkRed"]
["vfx_ToonHit_Bomb02Red",2,1.5,0,0,0,null,null,null,null,null,null,null,"vfx_Hit_Orb15_DarkOrange"]
["vfx_ToonHit_Plasma03Purple",2,1.5,0,0,0,null,null,null,null,null,null,null,"vfx_Hit_Orb15_DarkBlue"]
["vfx_ToonHit_Bomb03Orange",2,1.5,0,0,0,null,null,null,null,null,null,null,"vfx_Hit_Orb15_DarkBlue"]
["vfx_ToonHit_Bomb03Red",2,1.5,0,0,0,null,null,null,null,null,null,null,"vfx_Hit_Orb14_Red"]
["vfx_ToonHit_Bomb03Blue",2,1.5,0,0,0,null,null,null,null,null,null,null,"vfx_Hit_Orb13_DarkPurple"]
["vfx_ToonHit_Bullet01Green",2,3,0,0,0,null,null,null,null,null,null,null,"vfx_Hit_Orb13_DarkRed"]
["FX_Thunder Smoke",1,2,0,0,0,null,null,null,null,null,null,null,"vfx_Hit_Orb09_OrangePurple"]
["FX_BloodSlash_Five",5,2,0,0,0,null,null,null,null,null,null,null,"vfx_Hit_Orb09_BluePurple"]
["TouchEffect",1,3,0,0,0,"PS_Cast_Ice",null,null,null,null,null,null,"vfx_Hit_Orb09_BluePurple"]
["Light 2  -  Yellow",5,2.5,0,3,0.3,null,null,null,null,null,null,null,"vfx_Hit_Orb06_Purple"]
["SlashHitBlue",5,1,0,3,0,null,null,null,null,null,null,null,"vfx_Hit_Orb05_Purple"]
["PunchHitWhite",5,1.2,0,3.5,-0.5,null,null,null,null,null,null,null,"vfx_Hit_Orb04_Yellow"]
["ArrowHit",5,0.8,0,4,0,null,null,null,null,null,null,null,"vfx_Hit_Orb02_Pink"]
["FX_Splash_2Hit",5,1.8,0,0,0,null,null,null,null,null,null,null,"vfx_Hit_Fireball03_Orange"]
["FX_Shoot_06_muzzle",5,1.25,0,0,0,null,null,null,null,null,null,null,"vfx_Hit_Fireball03_Green"]
["FX_Shoot_08_muzzle",5,1.25,0,0,0]
["FX_Purple_Hit",5,1.4,0,0,0]
["BlueCannonHit",5,1,0,0,0]
["DrunkBuff",5,1,0,0,0]
["Hit_dark_magic",5,1,0,0,0]
["Hit_electric",5,1,0,0,0]
["Hit_fire",5,1,0,0,0]
["Hit_frost",5,1,0,0,0]
["Hit_green_shuriken",5,1,0,0,0]
["Hit_heart",5,1,0,0,0]
["Hit_light",5,1,0,0,0]
["Hit_magic",5,1,0,0,0]
["Hit_water",5,1,0,0,0]
["Hit_wind",5,1,0,0,0]
["FX_Buff_Skull",5,1,0,0,0,"저주"]
["FX_Skull_Dead",5,1.6,0,0,0]
["Sleeping",5,1.6,0,0,0]
["FX_Four Stab_Hit",5,1.2,0,2.6,-1]
["Heavy 2  -  Blue",5,1,0,0,0]
["Heavy 2  -  Yellow",5,1,0,0,0]
["PolygonSlash",5,1,0,0,0]
["Red_Sword",5,1,0,0,0]
["SlashHitComplex",5,0.8,0,2.8,0]
["FX_LevelUP",5,3,0,0,0]
["FX_LightPillar",5,1.6,0,0,0]
["FX_LightUpSmoke",5,1.8,0,0,0]
["LevelUp2",5,1,0,0,0,"가로2"]
["LevelUp3",5,1,0,0,0,"가로2"]
["Area_generic_blue_outbreak",5,2,0,0,0,null,"실드 회복"]
["Area_generic_green_outbreak",5,2,0,0,0,null,"HP 회복"]
["Area_generic_orange_outbreak",5,2,0,0,0]
["Area_generic_red_outbreak",5,2,0,0,0]
["Fog_poison",5,2.5,0,0.1,-4,null,"중독"]
["Fog_speedFast",5,2.5,0,0.1,-4,null,"속도 업"]
["Fog_speedSlow",5,2.5,0,0.1,-4,null,"슬로우"]
["Loot_flicker",5,2.5,0,0.1,-4]
["Loot_pick_up",5,2.6,0,0.2,-4.5]
["Regeneration_health",5,2.5,0,0.1,-3.5]
["Stun_loop",5,1.6,0,0,4.5]
["HCFX_Eye_01",5,1,0,0,0]
["HCFX_Heart_Get",5,1,0,0,0,null,"하트 투사체 히트"]
["HCFX_Hit_03",5,1,0,0,0,null,"클러 공격 히트"]
["FX_Blood_Hit_03",5,3,0,2,0]
["FX_Fire_Exp",5,1.8,0,0,0,null,"자폭"]
["FX_Water Splash_4Hit",5,2.2000000000000002,0,1,1]
["FX_Yellow_Hit",5,1.6,0.1,2.5,0.5]
["FX_YellowSlash_Hit",5,1.6,0,0,0]
["FX_Red_2Hit",5,1.2,0.15,-1.5,0.2]
["HCFX_Hit_09",5,1,0,0,0]
["Effect_Curse",5,3,0,0,0,null,"저주"]
["Effect_Curse_Exp",5,1,0,0,0,null,"저주 폭발"]
["DeathAttack_Hit",5,1,3,0,0,null,"사신의 낫 히트"]

{"sheet":"Sheet1","index":30,"n_rows":217,"n_cols":21,"rows_kept":217,"cut":false,"hidden":false,"merged":[]}
["ID","몬스터 이름","타입","LV"]
[11001,"놀1","수인형 몬스터",1,{"$f":"VLOOKUP(A2,MonsterList!$A$3:$Q$185,18,FALSE)","v":{"$error":"#REF!"}},null,null,40001,"Heal_All","Self","Sancturay",1,false,"None","None","None","0","0",0,0,"생명력과 보호막이 완전히 회복됩니다."]
[11002,"놀2","수인형 몬스터",1,{"$f":"VLOOKUP(A3,MonsterList!$A$3:$Q$185,18,FALSE)","v":{"$error":"#REF!"}},null,null,40002,"LvUp","Self","Sancturay",1,false,"None","None","None","0","0",0,0,"고대의 지식을 얻어 즉시 레벨업합니다."]
[11007,"놀아처2","수인형 몬스터",1,{"$f":"VLOOKUP(A4,MonsterList!$A$3:$Q$185,18,FALSE)","v":{"$error":"#REF!"}},null,null,40003,"AddResurrection","Self","Sancturay",1,false,"None","None","None","0","0",0,0,"사망 시 부활 효과를 얻었습니다."]
[14001,"펑거스","마법 생물",1,{"$f":"VLOOKUP(A5,MonsterList!$A$3:$Q$185,18,FALSE)","v":{"$error":"#REF!"}},null,null,40004,"GetSkillCard","Self","Sancturay",1,false,"None","None","None","0","0",0,0,"임의의 스킬 카드를 획득했습니다."]
[14002,"동굴 박쥐","마법 생물",1,{"$f":"VLOOKUP(A6,MonsterList!$A$3:$Q$185,18,FALSE)","v":{"$error":"#REF!"}},null,null,40005,"EXP_Mul","Self","Sancturay",1,false,"None","None","None","0","0",0,0,"경험치 획득량 x2배 효과를 얻었습니다."]
[14013,"동굴쥐1","마법 생물",1,{"$f":"VLOOKUP(A7,MonsterList!$A$3:$Q$185,18,FALSE)","v":{"$error":"#REF!"}},null,null,40006,"GOLD_mul","Self","Sancturay",1,false,"None","None","None","0","0",0,0,"골드 획득량 x2배 효과를 얻었습니다."]
[14018,"미믹","마법 생물",1,{"$f":"VLOOKUP(A8,MonsterList!$A$3:$Q$185,18,FALSE)","v":{"$error":"#REF!"}},null,null,40007,"GetSoul","Self","Sancturay",1,false,"None","None","None","5","10",0,0,"{0} 소울을 획득했습니다."]
[11003,"놀3","수인형 몬스터",2,{"$f":"VLOOKUP(A9,MonsterList!$A$3:$Q$185,18,FALSE)","v":{"$error":"#REF!"}},null,null,40008,"GetGold","Self","Sancturay",1,false,"None","None","None","15","20",0,0,"{0} 골드를 획득했습니다."]
[11005,"놀강도3","수인형 몬스터",2,{"$f":"VLOOKUP(A10,MonsterList!$A$3:$Q$185,18,FALSE)","v":{"$error":"#REF!"}},null,null,40009,"Invincibility","Self","Sancturay",1,false,"None","None","None","7","0",0,0,"{0}초 동안 무적 상태가 됩니다."]
[14003,"만드레고라","마법 생물",2,{"$f":"VLOOKUP(A11,MonsterList!$A$3:$Q$185,18,FALSE)","v":{"$error":"#REF!"}},null,null,40010,"Heal","Self","Sancturay",1,false,"None","None","None","10","0",0,0,"생명력 {0} 회복했습니다."]
[14017,"맹독사2","마법 생물",2,{"$f":"VLOOKUP(A12,MonsterList!$A$3:$Q$185,18,FALSE)","v":{"$error":"#REF!"}},null,null,40011,"GetExp","Self","Sancturay",1,false,"None","None","None","9","0",0,0,"경험치를 {0} 습득했습니다."]
[14021,"슬라임1","마법 생물",2,{"$f":"VLOOKUP(A13,MonsterList!$A$3:$Q$185,18,FALSE)","v":{"$error":"#REF!"}},null,null,40012,"Heal_Shield","Self","Sancturay",1,false,"None","None","None","8","0",0,0,"보호막이 {0} 회복되었습니다."]
[14024,"임프2","마법 생물",2,{"$f":"VLOOKUP(A14,MonsterList!$A$3:$Q$185,18,FALSE)","v":{"$error":"#REF!"}},null,null,10001,"Rusy_NormalAttack","Enemy","Attack_Normal","100%",false,"Buff","Attack_Min","Attack_Max",0,0,0,0]
[11008,"놀아처3","수인형 몬스터",3,{"$f":"VLOOKUP(A15,MonsterList!$A$3:$Q$185,18,FALSE)","v":{"$error":"#REF!"}},null,null,10002,"Rusy_Evasion","Enemy","Hit_PreemptiveStrike","100%",false,"None","None","None",0,0,0,0]
[11013,"미노타우로스 도살자1","수인형 몬스터",3,{"$f":"VLOOKUP(A16,MonsterList!$A$3:$Q$185,18,FALSE)","v":{"$error":"#REF!"}},null,null,10003,"Rusy_HitCritical","Enemy","Hit_Count","100%",false,"None","AddCri_Once","None","1%",0,0,0]
[11030,"트롤2","수인형 몬스터",3,{"$f":"VLOOKUP(A17,MonsterList!$A$3:$Q$185,18,FALSE)","v":{"$error":"#REF!"}},null,null,10004,"Rusy_CriticalRate","Enemy","None",0,false,"None","CriDmg","None","25%",0,0,0]
[11031,"트롤3","수인형 몬스터",3,{"$f":"VLOOKUP(A18,MonsterList!$A$3:$Q$185,18,FALSE)","v":{"$error":"#REF!"}},null,null,11001,"Slow","Enemy","Attack_Hit","30.5%",false,"Debuff","Slow","None","50%",3,0,0]
[14014,"동굴쥐2","마법 생물",3,{"$f":"VLOOKUP(A19,MonsterList!$A$3:$Q$185,18,FALSE)","v":{"$error":"#REF!"}},null,null,11002,"Berserker_ATK_DMG","Enemy","MaxHp_Up","6",false,"Buff","DmgMul","None","50%",0,0,0]
[14022,"슬라임2","마법 생물",3,{"$f":"VLOOKUP(A20,MonsterList!$A$3:$Q$185,18,FALSE)","v":{"$error":"#REF!"}},null,null,11003,"Berserker_ATK_SPD","Self","MaxHp_Down","4",false,"Buff","AttackCoolTimeMul","None","100%",0,0,0]
[11009,"미노타우르스 광전사1","수인형 몬스터",4,{"$f":"VLOOKUP(A21,MonsterList!$A$3:$Q$185,18,FALSE)","v":{"$error":"#REF!"}},null,null,11004,"ATK_SPD","Self","Attack_Normal","25%",false,"Buff","AttackCoolTimeMul","None","50%",10,0,0]
[11025,"싸이클롭스2","수인형 몬스터",4,{"$f":"VLOOKUP(A22,MonsterList!$A$3:$Q$185,18,FALSE)","v":{"$error":"#REF!"}},null,null,11005,"Heal","Self","ActiveSkill",3,false,"None","None","None",5,0,0,0]
[11006,"놀강도4","수인형 몬스터",5,{"$f":"VLOOKUP(A23,MonsterList!$A$3:$Q$185,18,FALSE)","v":{"$error":"#REF!"}},null,null,11006,"VampirHeal_ADD","Self","Attack_Critical","35%",false,"None","None","None",7,"0",0,0]
[11029,"트롤1","수인형 몬스터",5,{"$f":"VLOOKUP(A24,MonsterList!$A$3:$Q$185,18,FALSE)","v":{"$error":"#REF!"}},null,null,11007,"VampirHeal_Rate","Self","Attack_Critical","35%",false,"None","None","None","10%","0",0,0]
[12028,"오크 궁수1","인간형 몬스터",5,{"$f":"VLOOKUP(A25,MonsterList!$A$3:$Q$185,18,FALSE)","v":{"$error":"#REF!"}},null,null,11008,"DMG_IMMUNE ","Self","Appear",0,false,"Buff","Dmg_Immune","None",5,0,0,0]
[12032,"오크1","인간형 몬스터",5,{"$f":"VLOOKUP(A26,MonsterList!$A$3:$Q$185,18,FALSE)","v":{"$error":"#REF!"}},null,null,11009,"Self_destruct","Enemy","MaxHpRate","50%",false,"Buff","Self_Destruct","None","50%",1,0,0]
[13014,"사악한 악령1","언데드형 몬스터",5,{"$f":"VLOOKUP(A27,MonsterList!$A$3:$Q$185,18,FALSE)","v":{"$error":"#REF!"}},null,null,11010,"ATK_UP","Enemy","Hit_Noraml","30%",false,"Buff","DmgMul","None","100%","5",0,"0"]
[11004,"놀강도1","수인형 몬스터",6,{"$f":"VLOOKUP(A28,MonsterList!$A$3:$Q$185,18,FALSE)","v":{"$error":"#REF!"}},null,null,11011,"Death_ATK","Enemy","Die_Front","100%",false,"None","None","None",0,0,0,0]
[12031,"오크 마법사2","인간형 몬스터",6,{"$f":"VLOOKUP(A29,MonsterList!$A$3:$Q$185,18,FALSE)","v":{"$error":"#REF!"}},null,null,11012,"Death_Growup","Self","Die_Ally","100%",false,"None","None","None",0,0,0,0]
[12033,"오크2","인간형 몬스터",6,{"$f":"VLOOKUP(A30,MonsterList!$A$3:$Q$185,18,FALSE)","v":{"$error":"#REF!"}},null,null,11013,"Death_Heal","Self","Die_Back","100%",false,"None","None","None",0,0,0,0]
[14012,"데스웜","마법 생물",6,{"$f":"VLOOKUP(A31,MonsterList!$A$3:$Q$185,18,FALSE)","v":{"$error":"#REF!"}},null,null,11014,"Resurrection","Self","Die_Self","100%",false,"None","Resurrection_Shield","Resurrection_Heal","100%","100%",0,0]
[11024,"싸이클롭스1","수인형 몬스터",7,{"$f":"VLOOKUP(A32,MonsterList!$A$3:$Q$185,18,FALSE)","v":{"$error":"#REF!"}},null,null,11015,"Burn","Self","Attack_Critical","100%",true,"None","None","None","6",3,0,0]
[12029,"오크 궁수2","인간형 몬스터",7,{"$f":"VLOOKUP(A33,MonsterList!$A$3:$Q$185,18,FALSE)","v":{"$error":"#REF!"}},null,null,11016,"Invincibility","Self","MaxHpRate","10%",false,"None","None","None",0,0,0,0]
[12030,"오크 마법사1","인간형 몬스터",7,{"$f":"VLOOKUP(A34,MonsterList!$A$3:$Q$185,18,FALSE)","v":{"$error":"#REF!"}},null,null,11017,"Recovery_Shield ","Self","MaxShield_Rate","10%",false,"None","None","None",0,0,0,0]
[11012,"미노타우르스 광전사4","수인형 몬스터",8,{"$f":"VLOOKUP(A35,MonsterList!$A$3:$Q$185,18,FALSE)","v":{"$error":"#REF!"}},null,null,11018,"Poison","Self","Attack_Hit","30%",true,"None","None","None","4s","5",0,0]
[11014,"미노타우로스 도살자2","수인형 몬스터",8,{"$f":"VLOOKUP(A36,MonsterList!$A$3:$Q$185,18,FALSE)","v":{"$error":"#REF!"}},null,null,11019,"Stun","Ally","Attack_Hit","30%",true,"None","None","None",0,3,0,0]
[11018,"미노타우르스 챔피언4","수인형 몬스터",8,{"$f":"VLOOKUP(A37,MonsterList!$A$3:$Q$185,18,FALSE)","v":{"$error":"#REF!"}},null,null,11020,"Freezing","Ally","Attack_Hit","30%",true,"None","None","None",0,4,0,0]
[11019,"미노타우르스 챔피언5","수인형 몬스터",8,{"$f":"VLOOKUP(A38,MonsterList!$A$3:$Q$185,18,FALSE)","v":{"$error":"#REF!"}},null,null,11021,"Blind","Ally","Attack_Hit","30%",true,"None","None","None",0,7,0,0]
[12036,"활든 강도2","인간형 몬스터",8,{"$f":"VLOOKUP(A39,MonsterList!$A$3:$Q$185,18,FALSE)","v":{"$error":"#REF!"}},null,null,20001,"Slow","Ally","Attack_Hit","100%",false,"Debuff","Slow","None","3","70%",0,0,"둔화"]
[11021,"버그베어2","수인형 몬스터",9,{"$f":"VLOOKUP(A40,MonsterList!$A$3:$Q$185,18,FALSE)","v":{"$error":"#REF!"}},null,null,20002,"Berserker_ATK_DMG","Self","MaxHpRate","30%",false,"Buff","Attack_Min","Attack_Max","150%","0",0,0,"광포화-공격"]
[11022,"버그베어3","수인형 몬스터",9,{"$f":"VLOOKUP(A41,MonsterList!$A$3:$Q$185,18,FALSE)","v":{"$error":"#REF!"}},null,null,20003,"Berserker_ATK_SPD","Ally_Front","MaxHpRate","30%",false,"Buff","AttackCoolTimeMul","None","70%","0",0,0,"광포화-공속"]
[11023,"버그베어4","수인형 몬스터",9,{"$f":"VLOOKUP(A42,MonsterList!$A$3:$Q$185,18,FALSE)","v":{"$error":"#REF!"}},null,null,20004,"ATK_SPD","Ally_Front","Attack_Hit","100%",false,"None","None","None",0,"0",0,0,"신속화"]
[12017,"다크엘프 마법사1","인간형 몬스터",9,{"$f":"VLOOKUP(A43,MonsterList!$A$3:$Q$185,18,FALSE)","v":{"$error":"#REF!"}},null,null,20005,"Heal","Ally_Back","Attack_Hit","100%",false,"None","None","None",0,"0",0,0,"회복"]
[12025,"연쇄살인마1","인간형 몬스터",9,{"$f":"VLOOKUP(A44,MonsterList!$A$3:$Q$185,18,FALSE)","v":{"$error":"#REF!"}},null,null,20006,"VampirHeal_ADD","Ally_Back","Attack_Hit","100%",false,"None","None","None",0,"0",0,0,"흡혈-고정 피해"]
[11010,"미노타우르스 광전사2","수인형 몬스터",10,{"$f":"VLOOKUP(A45,MonsterList!$A$3:$Q$185,18,FALSE)","v":{"$error":"#REF!"}},null,null,20007,"VampirHeal_Rate","Ally","Attack_Hit","100%",false,"None","None","None",0,"0",0,0,"흡혈-비율 피해"]
[11011,"미노타우르스 광전사3","수인형 몬스터",10,{"$f":"VLOOKUP(A46,MonsterList!$A$3:$Q$185,18,FALSE)","v":{"$error":"#REF!"}},null,null,20008,"DMG_IMMUNE","Self","Attack_Hit","100%",false,"None","None","None",0,"0",0,0,"피해 무효(횟수)"]
[12024,"살인 청부업자3","인간형 몬스터",10,{"$f":"VLOOKUP(A47,MonsterList!$A$3:$Q$185,18,FALSE)","v":{"$error":"#REF!"}},null,null,20009,"Self_destruct","Self","MaxHp_Down",0.3,false,"None","None","None",0,"0",0,0,"자폭"]
[12037,"활든 강도3","인간형 몬스터",10,{"$f":"VLOOKUP(A48,MonsterList!$A$3:$Q$185,18,FALSE)","v":{"$error":"#REF!"}},null,null,20010,"ATK_UP","Self","Attack_Hit","100%",false,"None","None","None",0,"0",0,0,"강화-공격력"]
[11017,"미노타우르스 챔피언3","수인형 몬스터",11,{"$f":"VLOOKUP(A49,MonsterList!$A$3:$Q$185,18,FALSE)","v":{"$error":"#REF!"}},null,null,20011,"Death_ATK","Self","Attack_Hit","100%",false,"None","None","None",0,"0",0,0,"사망-공격력"]
[12013,"광전사6","인간형 몬스터",11,{"$f":"VLOOKUP(A50,MonsterList!$A$3:$Q$185,18,FALSE)","v":{"$error":"#REF!"}},null,null,20012,"Death_Growup","Self","Attack_Hit","100%",false,"None","None","None",0,"0",0,0,"사망-성장(거대화)"]
[12023,"살인 청부업자2","인간형 몬스터",11,{"$f":"VLOOKUP(A51,MonsterList!$A$3:$Q$185,18,FALSE)","v":{"$error":"#REF!"}},null,null,20013,"Death_Heal","Self","Attack_Hit","100%",false,"None","None","None",0,"0",0,0,"사망-회복"]
[12027,"연쇄살인마3","인간형 몬스터",11,{"$f":"VLOOKUP(A52,MonsterList!$A$3:$Q$185,18,FALSE)","v":{"$error":"#REF!"}},null,null,20014,"Resurrection","Self","Die_Self","1",false,"None","None","None",0,"0",0,0,"부활"]
[13017,"악마 광신자2","언데드형 몬스터",11,{"$f":"VLOOKUP(A53,MonsterList!$A$3:$Q$185,18,FALSE)","v":{"$error":"#REF!"}},null,null,20015,"Burn","Self","Attack_Hit",1,true,"None","None","None",0,"0",0,0,"화상"]
[12004,"고블린1","인간형 몬스터",12,{"$f":"VLOOKUP(A54,MonsterList!$A$3:$Q$185,18,FALSE)","v":{"$error":"#REF!"}},null,null,20016,"Invincibility","Self","Attack_Hit",1,false,"None","None","None",0,"0",0,0,"무적"]
[12005,"고블린 라이더1","인간형 몬스터",12,{"$f":"VLOOKUP(A55,MonsterList!$A$3:$Q$185,18,FALSE)","v":{"$error":"#REF!"}},null,null,20017,"Recovery_Shield","Self","Attack_Hit",1,false,"None","None","None",0,"0",0,0,"실드 회복"]
[12006,"고블린 라이더2","인간형 몬스터",12,{"$f":"VLOOKUP(A56,MonsterList!$A$3:$Q$185,18,FALSE)","v":{"$error":"#REF!"}},null,null,20018,"Poison","Self","Attack_Hit",1,true,"None","None","None",0,"0",0,0,"중독"]
[12007,"고블린 아처1","인간형 몬스터",12,{"$f":"VLOOKUP(A57,MonsterList!$A$3:$Q$185,18,FALSE)","v":{"$error":"#REF!"}},null,null,20019,"Stun","Self","Attack_Hit",1,false,"None","None","None",0,"0",0,0,"스턴"]
[13001,"네크로멘서1","언데드형 몬스터",13,{"$f":"VLOOKUP(A58,MonsterList!$A$3:$Q$185,18,FALSE)","v":{"$error":"#REF!"}},null,null,20020,"Freezing","Self","Attack_Hit",1,false,"None","None","None",0,"0",0,0,"빙결"]
[13004,"데스1","언데드형 몬스터",13,{"$f":"VLOOKUP(A59,MonsterList!$A$3:$Q$185,18,FALSE)","v":{"$error":"#REF!"}},null,null,20021,"Blind","Self","Attack_Hit",1,false,"None","None","None",0,"0",0,0,"눈멀기"]
[13007,"머미1","언데드형 몬스터",13,{"$f":"VLOOKUP(A60,MonsterList!$A$3:$Q$185,18,FALSE)","v":{"$error":"#REF!"}},null,null,20022,"Rusy_NormalAttack","Self","Attack_Hit",1,false,"None","None","None",0,"0",0,0,"루시 기본 공격"]
[13015,"사악한 악령2","언데드형 몬스터",13,{"$f":"VLOOKUP(A61,MonsterList!$A$3:$Q$185,18,FALSE)","v":{"$error":"#REF!"}},null,null,20023,"Rusy_Evasion","Self","Attack_Hit",1,false,"None","None","None",0,"0",0,0,"훔치기 확률과 선제공격을 받을 때 회피 확률 각각 증가"]
[13023,"임프 사역마1","언데드형 몬스터",13,{"$f":"VLOOKUP(A62,MonsterList!$A$3:$Q$185,18,FALSE)","v":{"$error":"#REF!"}},null,null,20024,"Rusy_HitCritical","Self","Attack_Hit",1,false,"None","None","None",0,"0",0,0,"피격 당한 횟수에 비례해 치명타 확률이 점차 증가 (※치명타 발동 후 초기화)"]
[13002,"네크로멘서2","언데드형 몬스터",14,{"$f":"VLOOKUP(A63,MonsterList!$A$3:$Q$185,18,FALSE)","v":{"$error":"#REF!"}},null,null,20025,"Rusy_CriticalRate","Self","Attack_Hit",1,false,"None","None","None",0,"0",0,0,"치명타 피해량 증가"]
[13005,"데스2","언데드형 몬스터",14,{"$f":"VLOOKUP(A64,MonsterList!$A$3:$Q$185,18,FALSE)","v":{"$error":"#REF!"}}]
[13008,"머미2","언데드형 몬스터",14,{"$f":"VLOOKUP(A65,MonsterList!$A$3:$Q$185,18,FALSE)","v":{"$error":"#REF!"}}]
[13026,"타락한 기사2","언데드형 몬스터",14,{"$f":"VLOOKUP(A66,MonsterList!$A$3:$Q$185,18,FALSE)","v":{"$error":"#REF!"}}]
[12008,"광전사1","인간형 몬스터",15,{"$f":"VLOOKUP(A67,MonsterList!$A$3:$Q$185,18,FALSE)","v":{"$error":"#REF!"}}]
[12010,"광전사3","인간형 몬스터",15,{"$f":"VLOOKUP(A68,MonsterList!$A$3:$Q$185,18,FALSE)","v":{"$error":"#REF!"}}]
[12012,"광전사5","인간형 몬스터",15,{"$f":"VLOOKUP(A69,MonsterList!$A$3:$Q$185,18,FALSE)","v":{"$error":"#REF!"}}]
[13003,"네크로멘서3","언데드형 몬스터",15,{"$f":"VLOOKUP(A70,MonsterList!$A$3:$Q$185,18,FALSE)","v":{"$error":"#REF!"}}]
[13019,"악마 광신자4","언데드형 몬스터",15,{"$f":"VLOOKUP(A71,MonsterList!$A$3:$Q$185,18,FALSE)","v":{"$error":"#REF!"}}]
[11026,"싸이클롭스3","수인형 몬스터",16,{"$f":"VLOOKUP(A72,MonsterList!$A$3:$Q$185,18,FALSE)","v":{"$error":"#REF!"}}]
[13028,"해골 궁수","언데드형 몬스터",16,{"$f":"VLOOKUP(A73,MonsterList!$A$3:$Q$185,18,FALSE)","v":{"$error":"#REF!"}}]
[13029,"해골 근위병","언데드형 몬스터",16,{"$f":"VLOOKUP(A74,MonsterList!$A$3:$Q$185,18,FALSE)","v":{"$error":"#REF!"}}]
[13031,"해골 기사1","언데드형 몬스터",16,{"$f":"VLOOKUP(A75,MonsterList!$A$3:$Q$185,18,FALSE)","v":{"$error":"#REF!"}}]
[14027,"임프 마법사1","마법 생물",16,{"$f":"VLOOKUP(A76,MonsterList!$A$3:$Q$185,18,FALSE)","v":{"$error":"#REF!"}}]
[11027,"예티1","수인형 몬스터",17,{"$f":"VLOOKUP(A77,MonsterList!$A$3:$Q$185,18,FALSE)","v":{"$error":"#REF!"}}]
[11028,"예티2","수인형 몬스터",17,{"$f":"VLOOKUP(A78,MonsterList!$A$3:$Q$185,18,FALSE)","v":{"$error":"#REF!"}}]
[12019,"다크엘프 마법사4","인간형 몬스터",17,{"$f":"VLOOKUP(A79,MonsterList!$A$3:$Q$185,18,FALSE)","v":{"$error":"#REF!"}}]
[12020,"도살자1","인간형 몬스터",17,{"$f":"VLOOKUP(A80,MonsterList!$A$3:$Q$185,18,FALSE)","v":{"$error":"#REF!"}}]
[13024,"임프 사역마2","언데드형 몬스터",17,{"$f":"VLOOKUP(A81,MonsterList!$A$3:$Q$185,18,FALSE)","v":{"$error":"#REF!"}}]
[12021,"도살자2","인간형 몬스터",18,{"$f":"VLOOKUP(A82,MonsterList!$A$3:$Q$185,18,FALSE)","v":{"$error":"#REF!"}}]
[12022,"살인 청부업자1","인간형 몬스터",18,{"$f":"VLOOKUP(A83,MonsterList!$A$3:$Q$185,18,FALSE)","v":{"$error":"#REF!"}}]
[13025,"타락한 기사1","언데드형 몬스터",18,{"$f":"VLOOKUP(A84,MonsterList!$A$3:$Q$185,18,FALSE)","v":{"$error":"#REF!"}}]
[14007,"구울1","마법 생물",18,{"$f":"VLOOKUP(A85,MonsterList!$A$3:$Q$185,18,FALSE)","v":{"$error":"#REF!"}}]
[14008,"구울2","마법 생물",19,{"$f":"VLOOKUP(A86,MonsterList!$A$3:$Q$185,18,FALSE)","v":{"$error":"#REF!"}}]
[14009,"구울3","마법 생물",19,{"$f":"VLOOKUP(A87,MonsterList!$A$3:$Q$185,18,FALSE)","v":{"$error":"#REF!"}}]
[14010,"다이어울프1","마법 생물",19,{"$f":"VLOOKUP(A88,MonsterList!$A$3:$Q$185,18,FALSE)","v":{"$error":"#REF!"}}]
[14011,"다이어울프2","마법 생물",19,{"$f":"VLOOKUP(A89,MonsterList!$A$3:$Q$185,18,FALSE)","v":{"$error":"#REF!"}}]
[14029,"임프 마법사3","마법 생물",19,{"$f":"VLOOKUP(A90,MonsterList!$A$3:$Q$185,18,FALSE)","v":{"$error":"#REF!"}}]
[14032,"임프 전사3","마법 생물",19,{"$f":"VLOOKUP(A91,MonsterList!$A$3:$Q$185,18,FALSE)","v":{"$error":"#REF!"}}]
[14023,"임프1","마법 생물",20,{"$f":"VLOOKUP(A92,MonsterList!$A$3:$Q$185,18,FALSE)","v":{"$error":"#REF!"}}]
[14025,"임프3","마법 생물",20,{"$f":"VLOOKUP(A93,MonsterList!$A$3:$Q$185,18,FALSE)","v":{"$error":"#REF!"}}]
[14030,"임프 마법사4","마법 생물",20,{"$f":"VLOOKUP(A94,MonsterList!$A$3:$Q$185,18,FALSE)","v":{"$error":"#REF!"}}]
[14031,"임프 전사2","마법 생물",20,{"$f":"VLOOKUP(A95,MonsterList!$A$3:$Q$185,18,FALSE)","v":{"$error":"#REF!"}}]
[14034,"흡혈귀1","마법 생물",20,{"$f":"VLOOKUP(A96,MonsterList!$A$3:$Q$185,18,FALSE)","v":{"$error":"#REF!"}}]
[13032,"해골 기사2","언데드형 몬스터",21,{"$f":"VLOOKUP(A97,MonsterList!$A$3:$Q$185,18,FALSE)","v":{"$error":"#REF!"}}]
[12001,"강도1","인간형 몬스터",22,{"$f":"VLOOKUP(A98,MonsterList!$A$3:$Q$185,18,FALSE)","v":{"$error":"#REF!"}}]
[12002,"강도2","인간형 몬스터",22,{"$f":"VLOOKUP(A99,MonsterList!$A$3:$Q$185,18,FALSE)","v":{"$error":"#REF!"}}]
[12003,"강도3","인간형 몬스터",22,{"$f":"VLOOKUP(A100,MonsterList!$A$3:$Q$185,18,FALSE)","v":{"$error":"#REF!"}}]
[12026,"연쇄살인마2","인간형 몬스터",22,{"$f":"VLOOKUP(A101,MonsterList!$A$3:$Q$185,18,FALSE)","v":{"$error":"#REF!"}}]
[13020,"악마 추종자1","언데드형 몬스터",22,{"$f":"VLOOKUP(A102,MonsterList!$A$3:$Q$185,18,FALSE)","v":{"$error":"#REF!"}}]
[13030,"해골 법사","언데드형 몬스터",22,{"$f":"VLOOKUP(A103,MonsterList!$A$3:$Q$185,18,FALSE)","v":{"$error":"#REF!"}}]
[13033,"해골 기사3","언데드형 몬스터",22,{"$f":"VLOOKUP(A104,MonsterList!$A$3:$Q$185,18,FALSE)","v":{"$error":"#REF!"}}]
[13034,"해골 기사4","언데드형 몬스터",22,{"$f":"VLOOKUP(A105,MonsterList!$A$3:$Q$185,18,FALSE)","v":{"$error":"#REF!"}}]
[11015,"미노타우르스 챔피언1","수인형 몬스터",23,{"$f":"VLOOKUP(A106,MonsterList!$A$3:$Q$185,18,FALSE)","v":{"$error":"#REF!"}}]
[11016,"미노타우르스 챔피언2","수인형 몬스터",23,{"$f":"VLOOKUP(A107,MonsterList!$A$3:$Q$185,18,FALSE)","v":{"$error":"#REF!"}}]
[12016,"다크엘프 기사4","인간형 몬스터",23,{"$f":"VLOOKUP(A108,MonsterList!$A$3:$Q$185,18,FALSE)","v":{"$error":"#REF!"}}]
[13006,"데스나이트2","언데드형 몬스터",23,{"$f":"VLOOKUP(A109,MonsterList!$A$3:$Q$185,18,FALSE)","v":{"$error":"#REF!"}}]
[13018,"악마 광신자3","언데드형 몬스터",23,{"$f":"VLOOKUP(A110,MonsterList!$A$3:$Q$185,18,FALSE)","v":{"$error":"#REF!"}}]
[14005,"무리안","마법 생물",23,{"$f":"VLOOKUP(A111,MonsterList!$A$3:$Q$185,18,FALSE)","v":{"$error":"#REF!"}}]
[11020,"버그베어1","수인형 몬스터",24,{"$f":"VLOOKUP(A112,MonsterList!$A$3:$Q$185,18,FALSE)","v":{"$error":"#REF!"}}]
[12009,"광전사2","인간형 몬스터",24,{"$f":"VLOOKUP(A113,MonsterList!$A$3:$Q$185,18,FALSE)","v":{"$error":"#REF!"}}]
[12011,"광전사4","인간형 몬스터",24,{"$f":"VLOOKUP(A114,MonsterList!$A$3:$Q$185,18,FALSE)","v":{"$error":"#REF!"}}]
[12018,"다크엘프 마법사3","인간형 몬스터",24,{"$f":"VLOOKUP(A115,MonsterList!$A$3:$Q$185,18,FALSE)","v":{"$error":"#REF!"}}]
[12034,"오크 워리어1","인간형 몬스터",24,{"$f":"VLOOKUP(A116,MonsterList!$A$3:$Q$185,18,FALSE)","v":{"$error":"#REF!"}}]
[12035,"활든 강도1","인간형 몬스터",24,{"$f":"VLOOKUP(A117,MonsterList!$A$3:$Q$185,18,FALSE)","v":{"$error":"#REF!"}}]
[12014,"다크엘프 기사2","인간형 몬스터",25,{"$f":"VLOOKUP(A118,MonsterList!$A$3:$Q$185,18,FALSE)","v":{"$error":"#REF!"}}]
[12015,"다크엘프 기사3","인간형 몬스터",25,{"$f":"VLOOKUP(A119,MonsterList!$A$3:$Q$185,18,FALSE)","v":{"$error":"#REF!"}}]
[13009,"머미3","언데드형 몬스터",25,{"$f":"VLOOKUP(A120,MonsterList!$A$3:$Q$185,18,FALSE)","v":{"$error":"#REF!"}}]
[13010,"바포메트1","언데드형 몬스터",25,{"$f":"VLOOKUP(A121,MonsterList!$A$3:$Q$185,18,FALSE)","v":{"$error":"#REF!"}}]
[14016,"맹독사1","마법 생물",25,{"$f":"VLOOKUP(A122,MonsterList!$A$3:$Q$185,18,FALSE)","v":{"$error":"#REF!"}}]
[14020,"스프리트","마법 생물",25,{"$f":"VLOOKUP(A123,MonsterList!$A$3:$Q$185,18,FALSE)","v":{"$error":"#REF!"}}]
[13012,"바포메트4","언데드형 몬스터",26,{"$f":"VLOOKUP(A124,MonsterList!$A$3:$Q$185,18,FALSE)","v":{"$error":"#REF!"}}]
[13021,"악마 추종자2","언데드형 몬스터",26,{"$f":"VLOOKUP(A125,MonsterList!$A$3:$Q$185,18,FALSE)","v":{"$error":"#REF!"}}]
[13022,"악마 추종자3","언데드형 몬스터",26,{"$f":"VLOOKUP(A126,MonsterList!$A$3:$Q$185,18,FALSE)","v":{"$error":"#REF!"}}]
[13027,"타락한 기사3","언데드형 몬스터",26,{"$f":"VLOOKUP(A127,MonsterList!$A$3:$Q$185,18,FALSE)","v":{"$error":"#REF!"}}]
[14026,"임프4","마법 생물",26,{"$f":"VLOOKUP(A128,MonsterList!$A$3:$Q$185,18,FALSE)","v":{"$error":"#REF!"}}]
[14004,"켄타우로스","마법 생물",27,{"$f":"VLOOKUP(A129,MonsterList!$A$3:$Q$185,18,FALSE)","v":{"$error":"#REF!"}}]
[14006,"타이가","마법 생물",27,{"$f":"VLOOKUP(A130,MonsterList!$A$3:$Q$185,18,FALSE)","v":{"$error":"#REF!"}}]
[14015,"리자드맨","마법 생물",27,{"$f":"VLOOKUP(A131,MonsterList!$A$3:$Q$185,18,FALSE)","v":{"$error":"#REF!"}}]
[14019,"셀로브","마법 생물",27,{"$f":"VLOOKUP(A132,MonsterList!$A$3:$Q$185,18,FALSE)","v":{"$error":"#REF!"}}]
[15002,"레드드래곤1","거인 종족",27,{"$f":"VLOOKUP(A133,MonsterList!$A$3:$Q$185,18,FALSE)","v":{"$error":"#REF!"}}]
[15012,"오우거3","거인 종족",27,{"$f":"VLOOKUP(A134,MonsterList!$A$3:$Q$185,18,FALSE)","v":{"$error":"#REF!"}}]
[14028,"임프 마법사2","마법 생물",28,{"$f":"VLOOKUP(A135,MonsterList!$A$3:$Q$185,18,FALSE)","v":{"$error":"#REF!"}}]
[14033,"하피","마법 생물",28,{"$f":"VLOOKUP(A136,MonsterList!$A$3:$Q$185,18,FALSE)","v":{"$error":"#REF!"}}]
[15001,"싸이 전사","거인 종족",28,{"$f":"VLOOKUP(A137,MonsterList!$A$3:$Q$185,18,FALSE)","v":{"$error":"#REF!"}}]
[15005,"약탈꾼2","거인 종족",28,{"$f":"VLOOKUP(A138,MonsterList!$A$3:$Q$185,18,FALSE)","v":{"$error":"#REF!"}}]
[15010,"예티6","거인 종족",28,{"$f":"VLOOKUP(A139,MonsterList!$A$3:$Q$185,18,FALSE)","v":{"$error":"#REF!"}}]
[15015,"트롤 워리어2","거인 종족",28,{"$f":"VLOOKUP(A140,MonsterList!$A$3:$Q$185,18,FALSE)","v":{"$error":"#REF!"}}]
[13016,"악마 광신자1","언데드형 몬스터",29,{"$f":"VLOOKUP(A141,MonsterList!$A$3:$Q$185,18,FALSE)","v":{"$error":"#REF!"}}]
[15013,"용암골렘1","거인 종족",29,{"$f":"VLOOKUP(A142,MonsterList!$A$3:$Q$185,18,FALSE)","v":{"$error":"#REF!"}}]
[15014,"트롤 워리어1","거인 종족",29,{"$f":"VLOOKUP(A143,MonsterList!$A$3:$Q$185,18,FALSE)","v":{"$error":"#REF!"}}]
[15016,"트롤 워리어3","거인 종족",29,{"$f":"VLOOKUP(A144,MonsterList!$A$3:$Q$185,18,FALSE)","v":{"$error":"#REF!"}}]
[15017,"트롤 워리어5","거인 종족",29,{"$f":"VLOOKUP(A145,MonsterList!$A$3:$Q$185,18,FALSE)","v":{"$error":"#REF!"}}]
[13013,"바포메트5","언데드형 몬스터",30,{"$f":"VLOOKUP(A146,MonsterList!$A$3:$Q$185,18,FALSE)","v":{"$error":"#REF!"}}]
[15004,"약탈꾼1","거인 종족",30,{"$f":"VLOOKUP(A147,MonsterList!$A$3:$Q$185,18,FALSE)","v":{"$error":"#REF!"}}]
[15006,"예티1","거인 종족",30,{"$f":"VLOOKUP(A148,MonsterList!$A$3:$Q$185,18,FALSE)","v":{"$error":"#REF!"}}]
[15008,"예티3","거인 종족",30,{"$f":"VLOOKUP(A149,MonsterList!$A$3:$Q$185,18,FALSE)","v":{"$error":"#REF!"}}]
[15009,"예티5","거인 종족",30,{"$f":"VLOOKUP(A150,MonsterList!$A$3:$Q$185,18,FALSE)","v":{"$error":"#REF!"}}]
[15011,"오우거2","거인 종족",30,{"$f":"VLOOKUP(A151,MonsterList!$A$3:$Q$185,18,FALSE)","v":{"$error":"#REF!"}}]
[13011,"바포메트3","언데드형 몬스터",31,{"$f":"VLOOKUP(A152,MonsterList!$A$3:$Q$185,18,FALSE)","v":{"$error":"#REF!"}}]
[15003,"레드드래곤2","거인 종족",31,{"$f":"VLOOKUP(A153,MonsterList!$A$3:$Q$185,18,FALSE)","v":{"$error":"#REF!"}}]
[15007,"예티2","거인 종족",31,{"$f":"VLOOKUP(A154,MonsterList!$A$3:$Q$185,18,FALSE)","v":{"$error":"#REF!"}}]
[15018,"트롤 워리어6","거인 종족",31,{"$f":"VLOOKUP(A155,MonsterList!$A$3:$Q$185,18,FALSE)","v":{"$error":"#REF!"}}]
[15019,"트롤 워리어7","거인 종족",31,{"$f":"VLOOKUP(A156,MonsterList!$A$3:$Q$185,18,FALSE)","v":{"$error":"#REF!"}}]
[]
[]
[]
[]
[]
[]
[]
[]
[]
[]
[]
[]
[]
[]
[]
[]
[]
[]
[]
[]
[]
["AAA Projectiles Vol 1","2D Projectile 27 heart","2D Projectile 27 heart"]
["AAA Projectiles Vol 1","FLASH_4","Projectile 4 yellow aroow"]
["AAA Projectiles Vol 1","2D Projectile 21 red arrow","2D Projectile 21 red arrow"]
["AAA Projectiles Vol 1","FLASH 21 red arrow","Projectile 21 red aroow"]
["AAA Projectiles Vol 1","Flash 3 black fire","Projectile 3 black fire"]
["AAA Projectiles Vol 1","Flash 6 blue fire","Projectile 6 blue fire"]
["AAA Projectiles Vol 1","Flash 16 fire","Projectile 16 fire"]
["AAA Projectiles Vol 2","FLASH_12","Projectile 12 cuts"]
["AAA Projectiles Vol 2","FLASH_7","Projectile 7 wind"]
["AAA Projectiles Vol 2","FLASH_19","Projectile 19 sun"]
["AAA Projectiles Vol 2","FLASH_8","Projectile 8 emergy"]
["AAA Projectiles Vol 2","FLASH_20","Projectile 20 black"]
["AAA Projectiles Vol 2","Flash 4","Projectile 4 fire"]
["UniqueProjectiles02_Demo","vfx_Projectile_Orb02_Pink","vfx_Projectile_Orb02_Pink"]
["UniqueProjectiles02_Demo","vfx_Projectile_Orb06_Purple","vfx_Projectile_Orb06_Purple"]
["UniqueProjectiles02_Demo","vfx_Projectile_Orb05_Purple","vfx_Projectile_Orb05_Purple"]
["UniqueProjectiles02_Demo","vfx_Projectile_Orb04_Yellow","vfx_Projectile_Orb04_Yellow"]
["UniqueProjectiles02_Demo","vfx_Projectile_Fireball03_Orange","vfx_Projectile_Fireball03_Orange"]
["UniqueProjectiles02_Demo","vfx_Projectile_Fireball03_Green","vfx_Projectile_Fireball03_Green"]
["UniqueProjectiles03_Demo","vfx_Projectile_Orb09_OrangePurple","vfx_Projectile_Orb09_OrangePurple"]
["UniqueProjectiles03_Demo","vfx_Projectile_Orb09_BluePurple","vfx_Projectile_Orb09_BluePurple"]
["UniqueProjectiles03_Demo","vfx_Projectile_Fireball07_Blue","vfx_Projectile_Fireball07_Blue"]
["UniqueProjectiles03_Demo","vfx_Projectile_Fireball07_Orange","vfx_Projectile_Fireball07_Orange"]
["UniqueProjectiles03_Demo","vfx_Projectile_Fireball07_Purple","vfx_Projectile_Fireball07_Purple"]
["UniqueProjectiles03_Demo","vfx_Projectile_Orb13_DarkPurple","vfx_Projectile_Orb13_DarkPurple"]
["UniqueProjectiles03_Demo","vfx_Projectile_Orb13_DarkRed","vfx_Projectile_Orb13_DarkRed"]
["UniqueProjectiles03_Demo","vfx_Projectile_Orb14_Yellow","vfx_Projectile_Orb14_Yellow"]
["UniqueProjectiles03_Demo","vfx_Projectile_Orb14_Red","vfx_Projectile_Orb14_Red"]
["UniqueProjectiles03_Demo","vfx_Projectile_Orb15_DarkBlue","vfx_Projectile_Orb15_DarkBlue"]
["UniqueProjectiles03_Demo","vfx_Projectile_Orb15_DarkRed","vfx_Projectile_Orb15_DarkRed"]
["UniqueProjectiles03_Demo","vfx_Projectile_Orb15_DarkOrange","vfx_Projectile_Orb15_DarkOrange"]
["UniqueProjectiles03_Demo","vfx_Projectile_Orb07_Purple","vfx_Projectile_Orb07_Purple"]
["UniqueToonProjectiles01_Demo","vfx_ToonProjectile_Fireball01Green","vfx_ToonProjectile_Fireball01Green"]
["UniqueToonProjectiles01_Demo","vfx_ToonProjectile_Fireball01Purple","vfx_ToonProjectile_Fireball01Purple"]
["UniqueToonProjectiles01_Demo","vfx_ToonProjectile_Bomb02Red","vfx_ToonProjectile_Bomb02Red"]
["UniqueToonProjectiles01_Demo","vfx_ToonProjectile_Plasma03Purple","vfx_ToonProjectile_Plasma03Purple"]
["UniqueToonProjectiles01_Demo","vfx_ToonProjectile_Bomb03Orang","vfx_ToonProjectile_Bomb03Orang"]
["UniqueToonProjectiles01_Demo","vfx_ToonProjectile_Bomb03Red","vfx_ToonProjectile_Bomb03Red"]
["UniqueToonProjectiles01_Demo","vfx_ToonProjectile_Bomb03Blue","vfx_ToonProjectile_Bomb03Blue"]
["UniqueToonProjectiles01_Demo","vfx_ToonProjectile_Bullet01Green","vfx_ToonProjectile_Bullet01Green"]

{"sheet":"Sheet2","index":31,"n_rows":184,"n_cols":26,"rows_kept":184,"cut":false,"hidden":false,"merged":[]}
["원본 참고용","몬스터 분류","Lv",null,"DPS","몬스터 특성",null,null,null,null,"e_StatusConditionsType","s_SkillTarget","s_SkillNoticeIcon","n_EffectNameDesc","n_EffectInfoDesc","b_SkillRepeat","s_RepeatEffect","s_SkillEffect"]
["놀아처1","보스 몬스터",1,"원거리",2.34,"크리티컬 10%",null,null,10001,null,"Status Enum 타입","Status 효과 적용 대상","Status 아이콘 정보","Status 효과의 이름","Status 효과의 설명","스킬 효과 지속시간 동안 반복 유무","반복 재생할 이펙트 경로","발생할 때 재생할 이펙트 경로",null,"설명"]
["놀강도2","보스 몬스터",2,"근접",3.91,"광포화- 신속화 30%",null,null,10002,null,"Slow","Enemy","Slow",13001,14001,1,"Repeat_Slow","Effect_Slow",null,"둔화"]
["임프전사1","보스 몬스터",3,"근접",5.1100000000000003,"광포화- 공격력 50%",null,null,10003,null,"Berserker_ATK_DMG","Self","Berserker_ATK_DMG",13002,14002,1,"Repeat_Berserker_ATK_DMG","Effect_Berserker_ATK_DMG",null,"광포화-공격"]
["오우거1","보스 몬스터",4,"근접",5.31,"체력 2배, 최대 공격력 2배",null,null,10004,null,"Berserker_ATK_SPD","Self","Berserker_ATK_SPD",13003,14003,1,"Repeat_Berserker_ATK_SPD","Effect_Berserker_ATK_SPD",null,"광포화-공속"]
["바포메트6","보스 몬스터",5,"원거리",5.91,"둔화 30%",null,null,10005,null,"ATK_SPD","Ally","ATK_SPD",13004,14004,1,"Repeat_ATK_SPD","Effect_ATK_SPD",null,"신속화"]
["거미여왕2","보스 몬스터",6,"원거리",6.38,"중독 5초",null,null,10006,null,"Heal","Ally_Random","None",13005,14005,0,"None","Effect_Heal",null,"회복"]
["흑기사2","보스 몬스터",7,"근접",7.55,"실드 회복",null,null,10007,null,"VampirHeal_ADD","Enemy","None",13006,14006,0,"None","Effect_VampirHeal_ADD",null,"흡혈-고정 피해"]
["늑대인간","보스 몬스터",8,"근접",8,"고정 피해 흡혈",null,null,10008,null,"VampirHeal_Rate","Enemy","None",13007,14007,0,"None","Effect_VampirHeal_Rate",null,"흡혈-비율 피해"]
["대사탄1","보스 몬스터",9,"근접",8.33,"무적 5초",null,null,10009,null,"DMG_IMMUNE","Enemy","DMG_IMMUNE",13008,14008,1,"Repeat_DMG_IMMUNE","Effect_DMG_IMMUNE",null,"피해 무효(횟수)"]
["다크엘프 아처1","보스 몬스터",10,"원거리",8.82,"광포화 - 신속","치명타 15%",null,10010,null,"Self_destruct","Self","None",13009,14009,0,"None","Effect_Self_destruct",null,"자폭"]
["대사탄2","보스 몬스터",11,"근접",9.2899999999999991,"피해 무효","강화 -공격력",null,10011,null,"ATK_UP","Ally","ATK_UP",13010,14010,1,"Repeat_ATK_UP","Effect_ATK_UP",null,"강화-공격력"]
["데스나이트3","보스 몬스터",12,"근접",9.68,"광포화 신속화 60%","치명타 15%",null,10012,null,"Death_ATK","Ally_Front","Death_ATK",13011,14011,1,"Repeat_Death_ATK","Effect_Death_ATK",null,"사망-공격력"]
["메두사1","보스 몬스터",13,"근접",10.5,"둔화 50%","실드 25%",null,10013,null,"Death_Growup","Ally","Death_Growup",13012,14012,1,"Repeat_Death_Growup","Effect_Death_Growup",null,"사망-성장(거대화)"]
["바포메트2","보스 몬스터",14,"원거리",11.31,"화상","공격력 25%",null,10014,null,"Death_Heal","Ally_Back","None",13013,14013,0,"None","Effect_Death_Heal",null,"사망-회복"]
["트롤 워리어4","보스 몬스터",15,"근접",12.59,"기절","치명타 15%",null,10015,null,"Resurrection","Self","None",13014,14014,0,"None","Effect_Resurrection",null,"부활"]
["흑기사3","보스 몬스터",16,"근접",13.4,"광포화 공격력","광포화 신속",null,10016,null,"Burn","Enemy","Burn",13015,14015,1,"Repeat_Burn","Effect_Burn",null,"화상"]
["흡혈귀여왕2","보스 몬스터",17,"원거리",14.24,"고정 피해 흡혈","실드 회복",null,10017,null,"Invincibility","Self","Invincibility",13016,14016,1,"Repeat_Invincibility","Effect_Invincibility",null,"무적"]
["에티4","보스 몬스터",18,"근접",15.4,"강화  공격력","부활",null,10018,null,"Recovery_Shield","Self","None",13017,14017,0,"None","Effect_Recovery_Shield",null,"실드 회복"]
["레드드래곤3","보스 몬스터",19,"근접",16.29,"화상","회복",null,10019,null,"Poison","Enemy","Poison",13018,14018,1,"Repeat_Poison","Effect_Poison",null,"중독"]
["메두사2","보스 몬스터",20,"원거리",17.12,"실드 회복","중독 5초",null,10020,null,"Stun","Enemy","Stun",13019,14019,1,"Repeat_Stun","Effect_Stun",null,"스턴"]
["흑기사1","보스 몬스터",21,"근접",18.489999999999998,"피해 무효","신속화",null,10021,null,"Freezing","Enemy","Freezing",13020,14020,1,"Repeat_Freezing","Effect_Freezing",null,"빙결"]
["용암골렘2","보스 몬스터",22,"근접",19.510000000000002,"광포화 공격력","화상",null,10022,null,"Blind","Enemy","Blind",13021,14021,1,"Repeat_Blind","Effect_Blind",null,"눈멀기"]
["레드드래곤1","보스 몬스터",23,"근접",20.7,"화상","회복",null,10023,null,"Rusy_NormalAttack","Self","Rusy_NormalAttack",13024,14024,0,"None","None",null,"루시 기본 공격"]
["바포메트7","보스 몬스터",24,"원거리",21.38,"실드 회복","둔화",null,10024,null,"Rusy_Evasion","Self","Rusy_Evasion",13025,14025,0,"None","None",null,"훔치기 확률과 선제공격을 받을 때 회피 확률 각각 증가"]
["거미여왕1","보스 몬스터",25,"원거리",22.93,"중독 5초","둔화 30%",null,10025,null,"Rusy_HitCritical","Self","Rusy_HitCritical",13026,14026,0,"None","None",null,"피격 당한 횟수에 비례해 치명타 확률이 점차 증가 (※치명타 발동 후 초기화)"]
["데스나이트1","보스 몬스터",26,"근접",24.06,"광포화 신속화 60%","부활",null,10026,null,"Rusy_CriticalRate","Self","Rusy_CriticalRate",13027,14027,0,"None","None",null,"치명타 피해량 증가"]
["레드드래곤4","보스 몬스터",27,"원거리",26.54,"피해 무효","회복","화상",10027]
["타락한 천사","보스 몬스터",28,"근접",28.48,"부활","무적","광포화 - 공격",10028]
["놀1","수인형 몬스터",1,"근접",0.76,"공속 빠름",null,null,11001]
["놀2","수인형 몬스터",1,"근접",0.9,"공속 빠름",null,null,11002]
["놀3","수인형 몬스터",2,"근접",1.65,"공속 빠름",null,null,11003]
["놀강도1","수인형 몬스터",6,"근접",2.71,"공속 빠름",null,null,11004]
["놀강도3","수인형 몬스터",2,"근접",1.9,"공속 빠름",null,null,11005]
["놀강도4","수인형 몬스터",5,"근접",2.0299999999999998,"공속 빠름",null,null,11006]
["놀아처2","수인형 몬스터",1,"원거리",1.1200000000000001,"치명타 확률+5%",null,null,11007,null,"n_StatusID","e_StatusConditionsType","e_ActiveConditions","s_ActiveConditionsValue","b_DotDmg","e_Stat1","s_DefaultStatValuePara1","e_Stat2","s_DefaultStatValuePara2","e_BuffType","s_UpgradeStatValuePara1","s_UpgradeStatValuePara2"]
["놀아처3","수인형 몬스터",3,"원거리",1.8,"치명타 확률+5%",null,null,11008,null,"능력치 고유 키값","사용할 효과 타입","발생 조건","발생 조건 값","도트 데미지","스탯1","기본 스텟 능력치 파라메터1","스탯2","기본 스텟 능력치 파라메터2","버프 타입","강화 시 증가 능력치 파라메터1","강화 시 증가 능력치 파라메터2",null,"발생 조건","Value 값","상세 설명"]
["미노타우르스 광전사1","수인형 몬스터",4,"근접",2.2799999999999998,"체력 10%",null,null,11009,null,10001,"Rusy_NormalAttack","Attack_Normal","100%",false,"Attack_Min",0,"Attack_Max",0,"Buff",0,0,null,"None","0 (사용 안함)","항상 적용되는 패시브 효과 개념"]
["미노타우르스 광전사2","수인형 몬스터",10,"근접",4.29,"체력 10%",null,null,11010,null,10002,"Rusy_Evasion","Hit_PreemptiveStrike","100%",false,"None",0,"None",0,"None",0,0,null,"Attack_Normal","발생 확률","기본 공격 시 {Value}% 확률로 발동"]
["미노타우르스 광전사3","수인형 몬스터",10,"근접",4.29,"체력 10%",null,null,11011,null,10003,"Rusy_HitCritical","Hit_Count","100%",false,"AddCri_Once","1%","None",0,"None",0,0,null,"Attack_Hit","발생 확률","기본 공격 명중 시 {Value}% 확률로 발동"]
["미노타우르스 광전사4","수인형 몬스터",8,"근접",2.96,"체력 10%",null,null,11012,null,10004,"Rusy_CriticalRate","None",0,false,"CriDmg","25%","None",0,"None",0,0,null,"Attack_Critical","발생 확률","치명타 공격 시 {Value}% 확률로 발동"]
["미노타우로스 도살자1","수인형 몬스터",3,"근접",1.95,"체력 10%",null,null,11013,null,11001,"Slow","Attack_Hit","30.5%",false,"Slow","50%","None",3,"Debuff",0,0,null,"Attack_Special","발생 확률","기본 공격 외 특수 효과 발동 시 {Value}% 확률로 발동"]
["미노타우로스 도살자2","수인형 몬스터",8,"근접",2.88,"체력 10%",null,null,11014,null,11002,"Berserker_ATK_DMG","MaxHp_Up","6",false,"DmgMul","50%","None",0,"Buff",0,0,null,"Hit_Noraml","발생 확률","피격 시 {Value}% 확률로 발동"]
["미노타우르스 챔피언1","수인형 몬스터",23,"근접",11.6,"피해 무효",null,null,11015,null,11003,"Berserker_ATK_SPD","MaxHp_Down","4",false,"AttackCoolTimeMul","100%","None",0,"Buff",0,0,null,"Hit_Count","피격 횟수","해당 피격 {Value} 횟수 충족 시 발동"]
["미노타우르스 챔피언2","수인형 몬스터",23,"근접",11.69,"피해 무효",null,null,11016,null,11004,"ATK_SPD","Attack_Normal","25%",false,"AttackCoolTimeMul","50%","None",10,"Buff",0,0,null,"Hit_PreemptiveStrike","발생 확률","선제 공격받는 상황에 {Value}% 확률로 발동"]
["미노타우르스 챔피언3","수인형 몬스터",11,"근접",4.79,"공격력 15%",null,null,11017,null,11005,"Heal","ActiveSkill",3,false,"None",5,"None",0,"None",0,0,null,"ActiveSkill","쿨타임","{Value} 초 쿨타임마다 액티브 스킬처럼 발동"]
["미노타우르스 챔피언4","수인형 몬스터",8,"근접",2.98,"공격력 15%",null,null,11018,null,11006,"VampirHeal_ADD","Attack_Critical","35%",false,"None",7,"None","0","None",0,0,null,"MaxHp_Up","남은 생명력","{Value} 값 상태 이상일 때 적용됨을 의미 (예: HP 5 이상일 때)"]
["미노타우르스 챔피언5","수인형 몬스터",8,"근접",2.85,"공격력 15%",null,null,11019,null,11007,"VampirHeal_Rate","Attack_Critical","35%",false,"None","10%","None","0","None",0,0,null,"MaxHp_Down","남은 생명력","{Value} 값 상태 이하일 때 적용됨을 의미 (예: HP 5 이하일 때)"]
["버그베어1","수인형 몬스터",24,"근접",12.42,"공격력 15%",null,null,11020,null,11008,"DMG_IMMUNE ","Appear",0,false,"Dmg_Immune",5,"None",0,"Buff",0,0,null,"MaxHpRate","남은 비율","{Value} = 100은 생명력 최대, {Value} = 0은 죽음을 의미"]
["버그베어2","수인형 몬스터",9,"근접",3.23,"공격력 15%",null,null,11021,null,11009,"Self_destruct","MaxHpRate","50%",false,"Self_Destruct","50%","None",1,"Buff",0,0,null,"MaxShield_Up","남은 실드량","{Value} 값 상태 이상일 때 적용됨을 의미"]
["버그베어3","수인형 몬스터",9,"근접",3.38,"공격력 15%",null,null,11022,null,11010,"ATK_UP","Hit_Noraml","30%",false,"DmgMul","100%","None","5","Buff",0,0,null,"MaxShield_Down","남은 실드량","{Value} 값 상태 이하일 때 적용됨을 의미"]
["버그베어4","수인형 몬스터",9,"근접",3.44,"공격력 15%",null,null,11023,null,11011,"Death_ATK","Die_Front","100%",false,"None",0,"None",0,"None",0,0,null,"MaxShield_Rate","남은 비율","{Value} = 100은 실드 최대, {Value} = 0은 실드 소멸을 의미"]
["싸이클롭스1","수인형 몬스터",7,"원거리",2.87,"치명타 피해량 + 30%",null,null,11024,null,11012,"Death_Growup","Die_Ally","100%",false,"None",0,"None",0,"None",0,0,null,"Appear","0 (사용 안함)","몬스터가 전투에 참여한 시점부터 발동 (전열 또는 후열)"]
["싸이클롭스2","수인형 몬스터",4,"원거리",2.2400000000000002,"치명타 피해량 + 30%",null,null,11025,null,11013,"Death_Heal","Die_Back","100%",false,"None",0,"None",0,"None",0,0,null,"SurviveAlone","0 (사용 안함)","몬스터가 전장에 혼자만 살아있는 상태일 때 발동"]
["싸이클롭스3","수인형 몬스터",16,"원거리",7.63,"치명타 피해량 + 30%",null,null,11026,null,11014,"Resurrection","Die_Self","100%",false,"Resurrection_Shield","100%","Resurrection_Heal","100%","None",0,0,null,"Die_Self","0 (사용 안함)","자신이 죽었을 때 발생"]
["예티1","수인형 몬스터",17,"근접",8.1199999999999992,"생명력 20%",null,null,11027,null,11015,"Burn","Attack_Critical","100%",true,"None","6","None",3,"None",0,0,null,"Die_Front","0 (사용 안함)","전열의 임의의 적이 죽었을 때 발생"]
["예티2","수인형 몬스터",17,"근접",8.0399999999999991,"생명력 20%",null,null,11028,null,11016,"Invincibility","MaxHpRate","10%",false,"None",0,"None",0,"None",0,0,null,"Die_Back","0 (사용 안함)","후열의 임의의 적이 죽었을 때 발생"]
["트롤1","수인형 몬스터",5,"근접",2.36,"회복",null,null,11029,null,11017,"Recovery_Shield ","MaxShield_Rate","10%",false,"None",0,"None",0,"None",0,0,null,"Die_Ally","0 (사용 안함)","임의의 아군이 죽었을 때 발생"]
["트롤2","수인형 몬스터",3,"근접",2.0299999999999998,"회복",null,null,11030,null,11018,"Poison","Attack_Hit","30%",true,"None",4,"None",5,"None",0,0,null,"Evasion_Count","회피 횟수","회피 발생 횟수가 {Value}일 때마다 발동"]
["트롤3","수인형 몬스터",3,"근접",1.93,"회복",null,null,11031,null,11019,"Stun","Attack_Hit","30%",false,"None",0,"None",3,"None",0,0,null,"Evasion_Rate","발생 확률","회피 성공 시 {Value}% 확률로 발동"]
["강도1","인간형 몬스터",22,"근접",10.45,"공격속도 빠름","치명타 5%",null,12001,null,11020,"Freezing","Attack_Hit","30%",false,"None",0,"None",4,"None",0,0,null,"Miss_Count","빗나감 횟수","빗나감 발생 횟수가 {Value}일 때마다 발동"]
["강도2","인간형 몬스터",22,"근접",10.42,"공격속도 빠름","치명타 5%",null,12002,null,11021,"Blind","Attack_Hit","30%",false,"None",0,"None",7,"None",0,0,null,"Miss_Rate","빗나감 확률","빗나감 발생 시 {Value}% 확률로 발동"]
["강도3","인간형 몬스터",22,"근접",10.43,"공격속도 빠름","치명타 5%",null,12003,null,110002,"Berserker_ATK_SPD","MaxHp_Down",0.5,false,"AttackCoolTimeMul",1.3,"None",0,"eStat",0,0,null,"Potion_Use","발생 확률","포션 사용 시 {Value}% 확률로 발동"]
["고블린1","인간형 몬스터",12,"근접",5.37,"사망 - 공격력",null,null,12004,null,110003,"Berserker_ATK_DMG","MaxHp_Down",0.5,false,"DmgMul",1.5,"None",0,"Buff",0,0,null,"Potion_Count","사용 횟수","포션 사용 {Value} 횟수 충족 시 발동"]
["고블린 라이더1","인간형 몬스터",12,"근접",5.33,"사망 - 공격력",null,null,12005,null,110005,"Slow","Attack_Hit",0.3,false,"Slow","30%","None",3,"Debuff",0,0]
["고블린 라이더2","인간형 몬스터",12,"근접",5.32,"사망 - 공격력",null,null,12006,null,110006,"Poison","Attack_Hit",0.3,true,"None","1","None",5,"Buff",0,0]
["고블린 아처1","인간형 몬스터",12,"원거리",5.03,"사망 - 공격력",null,null,12007,null,110007,"Recovery_Shield","MaxHpRate","30%",false,"Resurrection_Shield","100%","None",0,"Buff",0,0,"None","없음"]
["광전사1","인간형 몬스터",15,"근접",6.71,"광포화 - 공격력","치명타 피해량20%",null,12008,null,110008,"VampirHeal_ADD","Attack_Hit",1,false,"None","0","None",0,"Buff",0,0,"eStat","DmgMul"]
["광전사2","인간형 몬스터",24,"근접",12.92,"광포화 - 공격력","치명타 피해량20%",null,12009,null,10008,"Invincibility","Appear",0,false,"None","5","None",0,"Buff",0,0,"eStat","AttackCoolTimeMul"]
["광전사3","인간형 몬스터",15,"근접",6.82,"광포화 - 공격력","치명타 피해량20%",null,12010,null,10009,"Berserker_ATK_SPD","MaxHp_Down",0.5,false,"AttackCoolTimeMul",1.45,null,null,null,null,null,"eStat","AttackCoolTime, // 공격 쿨타임"]
["광전사4","인간형 몬스터",24,"근접",12.85,"광포화 - 공격력","치명타 피해량20%",null,12011,null,10010,"DMG_IMMUNE ","Appear",0,false,"Dmg_Immune",5,null,null,null,null,null,"eStat","Attack_Min, // 최소 공격력"]
["광전사5","인간형 몬스터",15,"근접",6.77,"광포화 - 공격력","치명타 피해량20%",null,12012,null,10011,"Berserker_ATK_SPD","MaxHp_Down",0.5,false,"AttackCoolTimeMul",1.6,null,null,null,null,null,"eStat","Attack_Max, // 최대 공격력"]
["광전사6","인간형 몬스터",11,"근접",4.54,"광포화 - 공격력","치명타 피해량20%",null,12013,null,10012,"Slow","Attack_Hit",0.3,false,"Slow","50%","None",3,null,null,null,"eStat","Cri, // 치명타 확률"]
["다크엘프 기사2","인간형 몬스터",25,"근접",13.68,"피해 무효","치명타 5%",null,12014,null,10013,"Burn","Attack_Hit",0.3,null,null,null,null,null,null,null,null,"eStat","CriDmg, // 치명타 데미지"]
["다크엘프 기사3","인간형 몬스터",25,"근접",13.76,"피해 무효","치명타 5%",null,12015,null,10014,"Stun","Attack_Hit",0.1,null,null,null,null,null,null,null,null,"eStat","HitRate, // 명중률"]
["다크엘프 기사4","인간형 몬스터",23,"근접",11.63,"피해 무효","치명타 5%",null,12016,null,10015,"광포화 공격력",null,null,null,null,null,null,null,null,null,null,"eStat","HP, MaxHP, // 생명력 "]
["다크엘프 마법사1","인간형 몬스터",9,"원거리",3.35,"둔화 50%",null,null,12017,null,10016,"고정 피해 흡혈",null,null,null,null,null,null,null,null,null,null,"eStat","Shield, MaxShield, // 보호막"]
["다크엘프 마법사3","인간형 몬스터",24,"원거리",12.44,"회복",null,null,12018,null,10017,"강화  공격력",null,null,null,null,null,null,null,null,null,null,"eStat","Potion, MaxPotion, // 포션 개수"]
["다크엘프 마법사4","인간형 몬스터",17,"원거리",8.16,"화상",null,null,12019,null,10018,"화상",null,null,null,null,null,null,null,null,null,null,"eStat","Avoid_Melee, Avoid_Range, // 회피율"]
["도살자1","인간형 몬스터",17,"근접",8.23,"중독 5초",null,null,12020,null,10019,"실드 회복",null,null,null,null,null,null,null,null,null,null,"eStat","MoveSpeed, // 이동 속도"]
["도살자2","인간형 몬스터",18,"근접",8.34,"광전사 2배",null,null,12021,null,10020,"피해 무효",null,null,null,null,null,null,null,null,null,null,"eStat","FixedDmg, // 고정 데미지(이 값 우선)"]
["살인 청부업자1","인간형 몬스터",18,"근접",8.36,"광전사 2배",null,null,12022,null,10021,"광포화 공격력",null,null,null,null,null,null,null,null,null,null,"buff","AddDmg_1Time, // 1회성 데미지 증가"]
["살인 청부업자2","인간형 몬스터",11,"근접",4.6100000000000003,"치명타 확률 20%",null,null,12023,null,10022,"화상",null,null,null,null,null,null,null,null,null,null,"buff","AddDmgMul_1Time, // 1회성 데미지(%) 증가"]
["살인 청부업자3","인간형 몬스터",10,"근접",4.3899999999999997,"치명타 확률 20%",null,null,12024,null,10023,"실드 회복",null,null,null,null,null,null,null,null,null,null,"buff","AddCri_1Time, // 1회성 치명타 확률 증가"]
["연쇄살인마1","인간형 몬스터",9,"근접",3.65,"공속 빠름","흡혈",null,12025,null,10024,"Poison","Attack_Hit",1,true,"None","3","None",5,"Buff",0,0,"buff","AddCri_Once, // 치명타 확률 증가 : 치명타 발생 시 사라짐"]
["연쇄살인마2","인간형 몬스터",22,"근접",10.54,"공속 빠름","흡혈",null,12026,null,10025,"Berserker_ATK_SPD","MaxHp_Down",0.5,false,"AttackCoolTimeMul",1.6,null,null,null,null,null,"buff","ReduceMeeleDmg, // 근접 데미지 감소"]
["연쇄살인마3","인간형 몬스터",11,"근접",4.68,"공속 빠름","흡혈",null,12027,null,10026,"피해 무효",null,null,null,null,null,null,null,null,null,null,"buff","ReduceRangeDmg, // 원거리 데미지 감소"]
["오크 궁수1","인간형 몬스터",5,"원거리",2.3199999999999998,"사망 - 회복",null,null,12028,null,10027,"Resurrection","Die_Self","100%",false,"Resurrection","1","Resurrection_Heal","100%","Buff",0,0,"buff","AddDmgMul_MiddleLine, // 후열에 있는 적에게 데미지 증가 (%)"]
["오크 궁수2","인간형 몬스터",7,"원거리",2.79,"사망 - 회복",null,null,12029,null,10028,null,null,null,null,null,null,null,null,null,null,null,"buff","MaxAttack_byShield, // G4_MaxAttackIncreasesByShield"]
["오크 마법사1","인간형 몬스터",7,"원거리",2.87,"사망 - 회복",null,null,12030,null,null,null,null,null,null,null,null,null,null,null,null,null,"debuff","MyRangeAttackAvoid, // 나의 원거리 공격이 회피 당함"]
["오크 마법사2","인간형 몬스터",6,"원거리",2.65,"사망 - 회복",null,null,12031,null,null,null,null,null,null,null,null,null,null,null,null,null,"debuff","Slow, // 공속이 느려짐"]
["오크1","인간형 몬스터",5,"근접",2.23,"사망 - 회복",null,null,12032,null,null,null,null,null,null,null,null,null,null,null,null,null,"debuff","Resurrection, // 부활 개수"]
["오크2","인간형 몬스터",6,"근접",2.73,"사망 - 회복",null,null,12033,null,null,null,null,null,null,null,null,null,null,null,null,null,"debuff","Resurrection_Shield, // 부활 시 실드 회복량 (%)"]
["오크 워리어1","인간형 몬스터",24,"근접",12.78,"사망 - 회복",null,null,12034,null,null,null,null,null,null,null,null,null,null,null,null,null,"debuff","Resurrection_Heal, // 부활 시 hp 회복량 (%)"]
["활든 강도1","인간형 몬스터",24,"원거리",12.75,"공격력 15%","공속 15%",null,12035,null,null,null,null,null,null,null,null,null,null,null,null,null,"debuff","Self_Destruct, // 자폭"]
["활든 강도2","인간형 몬스터",8,"원거리",2.95,"공격력 15%","공속 15%",null,12036]
["활든 강도3","인간형 몬스터",10,"원거리",4.24,"공격력 15%","공속 15%",null,12037]
["네크로멘서1","언데드형 몬스터",13,"원거리",5.38,"실드 회복","공격력 20%",null,13001]
["네크로멘서2","언데드형 몬스터",14,"원거리",6.18,"실드 회복","공격력 20%",null,13002]
["네크로멘서3","언데드형 몬스터",15,"원거리",6.65,"실드 회복","공격력 20%",null,13003]
["데스1","언데드형 몬스터",13,"근접",5.3,"사망 회복",null,null,13004]
["데스2","언데드형 몬스터",14,"근접",6.26,"사망 회복",null,null,13005]
["데스나이트2","언데드형 몬스터",23,"근접",11.6,"공격력 증가",null,null,13006]
["머미1","언데드형 몬스터",13,"근접",5.29,"중독 5초",null,null,13007]
["머미2","언데드형 몬스터",14,"근접",6.21,"중독 5초",null,null,13008]
["머미3","언데드형 몬스터",25,"근접",13.39,"중독 5초",null,null,13009]
["바포메트1","언데드형 몬스터",25,"원거리",13.29,"광포화",null,null,13010]
["바포메트3","언데드형 몬스터",32,"원거리",25.67,"광포화",null,null,13011]
["바포메트4","언데드형 몬스터",26,"원거리",15.18,"광포화",null,null,13012]
["바포메트5","언데드형 몬스터",31,"원거리",23.19,"광포화",null,null,13013]
["사악한 악령1","언데드형 몬스터",5,"근접",2.31,"실드 증가",null,null,13014]
["사악한 악령2","언데드형 몬스터",13,"근접",5.43,"실드 증가",null,null,13015]
["악마 광신자1","언데드형 몬스터",30,"원거리",21.2,"회복",null,null,13016]
["악마 광신자2","언데드형 몬스터",11,"원거리",4.7699999999999996,"회복",null,null,13017]
["악마 광신자3","언데드형 몬스터",23,"원거리",11.62,"회복",null,null,13018]
["악마 광신자4","언데드형 몬스터",15,"원거리",6.77,"회복",null,null,13019]
["악마 추종자1","언데드형 몬스터",22,"근접",10.62,"중독 5초",null,null,13020]
["악마 추종자2","언데드형 몬스터",26,"근접",15.69,"자폭",null,null,13021]
["악마 추종자3","언데드형 몬스터",26,"근접",15.35,"치명타 15%","치명타 피해량 20%",null,13022]
["임프 사역마1","언데드형 몬스터",13,"근접",5.61,"회피력","회피력",null,13023]
["임프 사역마2","언데드형 몬스터",17,"근접",8.07,"회피력","회피력",null,13024]
["타락한 기사1","언데드형 몬스터",18,"근접",8.3000000000000007,"피해 무효",null,null,13025]
["타락한 기사2","언데드형 몬스터",14,"근접",6.32,"피해 무효",null,null,13026]
["타락한 기사3","언데드형 몬스터",26,"근접",15.34,"피해 무효",null,null,13027]
["해골 궁수","언데드형 몬스터",16,"원거리",7.59,"부활","버서커 공속",null,13028]
["해골 근위병","언데드형 몬스터",16,"근접",7.61,"부활","피해 무효",null,13029]
["해골 법사","언데드형 몬스터",22,"원거리",10.55,"부활","회복",null,13030]
["해골 기사1","언데드형 몬스터",16,"근접",7.61,"부활",null,null,13031]
["해골 기사2","언데드형 몬스터",21,"근접",10.15,"부활",null,null,13032]
["해골 기사3","언데드형 몬스터",22,"근접",10.63,"부활",null,null,13033]
["해골 기사4","언데드형 몬스터",22,"근접",10.65,"부활",null,null,13034]
["펑거스","마법 생물",1,"근접",1.27,"중독 5초",null,null,14001]
["동굴 박쥐","마법 생물",1,"근접",1.3,null,null,null,14002]
["만드레고라","마법 생물",2,"근접",1.93,"중독 5초",null,null,14003]
["켄타우로스","마법 생물",27,"근접",16.690000000000001,"광전사 2배",null,null,14004]
["무리안","마법 생물",23,"근접",11.49,"슬로우",null,null,14005]
["타이가","마법 생물",27,"근접",16.46,"치명타 확률","치명타 피해량",null,14006]
["구울1","마법 생물",18,"근접",8.3699999999999992,"광전사 공격력",null,null,14007]
["구울2","마법 생물",19,"근접",8.85,"광전사 공격력",null,null,14008]
["구울3","마법 생물",19,"근접",8.85,"광전사 공격력",null,null,14009]
["다이어울프1","마법 생물",19,"근접",8.74,"치명타 확률",null,null,14010]
["다이어울프2","마법 생물",19,"근접",8.81,"치명타 확률",null,null,14011]
["데스웜","마법 생물",6,"근접",2.77,"회복",null,null,14012]
["동굴쥐1","마법 생물",1,"근접",1.21,"중독 5초",null,null,14013]
["동굴쥐2","마법 생물",3,"근접",2.0299999999999998,"중독 5초",null,null,14014]
["리자드맨","마법 생물",27,"근접",16.489999999999998,"치명타 확률","치명타 피해",null,14015]
["맹독사1","마법 생물",25,"근접",13.45,"중독 5초",null,null,14016]
["맹독사2","마법 생물",2,"근접",1.65,"중독 5초",null,null,14017]
["미믹","마법 생물",1,"근접",1.38,"-",null,null,14018]
["셀로브","마법 생물",27,"근접",16.63,"슬로우",null,null,14019]
["스프리트","마법 생물",25,"근접",13.45,"회피력","회피력",null,14020]
["슬라임1","마법 생물",2,"근접",1.89,"회복",null,null,14021]
["슬라임2","마법 생물",3,"근접",2.2599999999999998,"회복",null,null,14022]
["임프1","마법 생물",20,"근접",9.3699999999999992,"사망-성장",null,null,14023]
["임프2","마법 생물",2,"근접",1.78,null,null,null,14024]
["임프3","마법 생물",20,"근접",9.3699999999999992,"사망 회복",null,null,14025]
["임프4","마법 생물",26,"근접",15.48,"사망 공격력",null,null,14026]
["임프 마법사1","마법 생물",16,"원거리",7.64,"사망 공격력",null,null,14027]
["임프 마법사2","마법 생물",29,"원거리",18.29,"사망 공속",null,null,14028]
["임프 마법사3","마법 생물",19,"원거리",8.73,"화상",null,null,14029]
["임프 마법사4","마법 생물",20,"원거리",9.48,"사망 회복",null,null,14030]
["임프 전사2","마법 생물",20,"근접",9.41,"사망-성장",null,null,14031]
["임프 전사3","마법 생물",19,"근접",8.6999999999999993,"사망-성장",null,null,14032]
["하피","마법 생물",29,"근접",18.52,"부활","치명타",null,14033]
["흡혈귀1","마법 생물",20,"근접",10.15,"흡혈",null,null,14034]
["싸이 전사","거인 종족",29,"근접",19.62,"공격력","치명타",null,15001]
["레드드래곤1","거인 종족",27,"원거리",18.399999999999999,"생명력 20%","공격력 20%",null,15002]
["레드드래곤2","거인 종족",32,"원거리",25.85,"생명력 20%","화상",null,15003]
["약탈꾼1","거인 종족",31,"근접",23.15,"공격력",null,null,15004]
["약탈꾼2","거인 종족",29,"근접",19.68,"공격력",null,null,15005]
["예티1","거인 종족",31,"근접",23.35,"공격력",null,null,15006]
["예티2","거인 종족",32,"근접",25.86,"공격력","버서커 공격력",null,15007]
["예티3","거인 종족",31,"근접",23.59,"공격력","버서커 공격력",null,15008]
["예티5","거인 종족",31,"근접",23.63,"공격력","생명",null,15009]
["예티6","거인 종족",29,"근접",19.829999999999998,"공격력","생명",null,15010]
["오우거2","거인 종족",31,"근접",23.68,"생명력",null,null,15011]
["오우거3","거인 종족",27,"근접",18.34,"생명력",null,null,15012]
["용암골렘1","거인 종족",30,"근접",21.48,"화상","생명력",null,15013]
["트롤 워리어1","거인 종족",30,"근접",21.68,"생명력","치명타 피해량",null,15014]
["트롤 워리어2","거인 종족",29,"근접",19.78,"공격력","치명타 피해량",null,15015]
["트롤 워리어3","거인 종족",30,"근접",21.68,"실드","치명타 피해량",null,15016]
["트롤 워리어5","거인 종족",30,"근접",21.65,"생명력","치명타 피해량",null,15017]
["트롤 워리어6","거인 종족",32,"근접",25.87,"생명력","공격력 20%",null,15018]
["트롤 워리어7","거인 종족",32,"근접",25.78,"생명력","공격력 20%",null,15019]

{"sheet":"몬스터 배치 컨셉","index":32,"n_rows":184,"n_cols":37,"rows_kept":184,"cut":false,"hidden":false,"merged":[]}
["몬스터 ID","몬스터 이름","몬스터 종류","몬스터 이미지","몬스터 Icon","처치 시 획득 경험치","체력","보호막","공격 쿨타임","최소 공격력","최대 공격력","명중력 (정수)","치명타 확률","치명타 피해량","회피력(근) (정수)","회피력(원) (정수)","기본 공격 타입","기본 공격 투사체 경로","몬스터 특성1","몬스터 특성2","몬스터 특성3","몬스터 특성4","원본 참고용","몬스터 분류","Lv",null,null,null,null,null,null,null,null,null,null,null,"FX_Slash_Ground2"]
[10001,110001,"Boss_Melee",10001,10001,10,20,15,2.2999999999999998,4,6,100,25,150,34,34,"Range","Projectile 12 cuts",11001,0,0,0,"놀아처1","보스 몬스터",1,"보스-원거리",null,10001,"놀아처1","보스 몬스터",1,"원거리",null,null,"Projectile 12 cuts"]
[11001,111001,"Normal_Melee",11001,11001,1,2,0,1.6,1,2,100,5,130,30,30,"Melee","MeleeAttack",11009,0,0,0,"놀1","수인형 몬스터",1,"근접",null,10002,"놀강도2","보스 몬스터",2,"근접","MeleeAttack_Sword",null,"MeleeAttack_Sword"]
[11002,111002,"Normal_Melee",11002,11002,1,2,0,1.85,1,3,100,5,130,30,30,"Melee","MeleeAttack",11001,0,0,0,"놀2","수인형 몬스터",1,"근접",null,10003,"임프전사1","보스 몬스터",3,"근접","MeleeAttack_Sword",null,"MeleeAttack_Sword"]
[11007,111007,"Normal_Range",11007,11007,0,1,0,2.7,2,4,100,8,120,30,30,"Range","Projectile 12 cuts",11007,0,0,0,"놀아처2","수인형 몬스터",1,"원거리",null,10004,"오우거1","보스 몬스터",4,"근접","MeleeAttack_Blunt",null,"MeleeAttack_Blunt"]
[14001,114001,"Normal_Melee",14001,14001,1,2,0,2,2,3,100,5,130,30,30,"Melee","MeleeAttack",11001,0,0,0,"펑거스","마법 생물",1,"근접",null,10005,"바포메트6","보스 몬스터",5,"원거리",null,null,"Projectile 8 emergy"]
[14002,114002,"Normal_Melee",14002,14002,1,2,0,1.95,2,3,100,5,130,30,30,"Melee","MeleeAttack",11001,0,0,0,"동굴 박쥐","마법 생물",1,"근접",null,10006,"거미여왕2","보스 몬스터",6,"원거리",null,null,"vfx_ToonProjectile_Fireball01Purple"]
[14013,114013,"Normal_Melee",14013,14013,1,2,0,2.1,2,3,100,5,130,30,30,"Melee","MeleeAttack",11001,0,0,0,"동굴쥐1","마법 생물",1,"근접",null,10007,"흑기사2","보스 몬스터",7,"근접","MeleeAttack_Sword",null,"MeleeAttack_Sword"]
[14018,114018,"Normal_Melee",14018,14018,1,2,0,2.2000000000000002,2,4,100,5,130,30,30,"Melee","MeleeAttack",11001,0,0,0,"미믹","마법 생물",1,"근접",null,10008,"늑대인간","보스 몬스터",8,"근접","MeleeAttack_Claw",null,"MeleeAttack_Claw"]
[10002,110002,"Boss_Melee",10002,10002,15,30,22,1.9,6,8,100,12.5,150,34,34,"Melee","MeleeAttack",11001,0,0,0,"놀강도2","보스 몬스터",2,"보스-근접",null,10009,"대사탄1","보스 몬스터",9,"근접","MeleeAttack_Blunt",null,"MeleeAttack_Blunt"]
[11003,111003,"Normal_Melee",11003,11003,1,3,0,1.4500000000000002,2,4,100,5,130,30,30,"Melee","MeleeAttack",11001,0,0,0,"놀3","수인형 몬스터",2,"근접",null,10010,"다크엘프 아처1","보스 몬스터",10,"원거리",null,null,"Projectile 7 wind"]
[11005,111005,"Normal_Melee",11005,11005,1,3,0,1.2000000000000002,2,4,100,5,130,30,30,"Melee","MeleeAttack",11001,0,0,0,"놀강도3","수인형 몬스터",2,"근접",null,10011,"대사탄2","보스 몬스터",11,"근접","MeleeAttack_Sword",null,"MeleeAttack_Sword"]
[14003,114003,"Normal_Melee",14003,14003,1,3,0,2.1,3,5,100,5,130,30,30,"Melee","MeleeAttack",11001,0,0,0,"만드레고라","마법 생물",2,"근접",null,10012,"데스나이트3","보스 몬스터",12,"근접","MeleeAttack_Sword",null,"MeleeAttack_Sword"]
[14017,114017,"Normal_Melee",14017,14017,1,3,0,2.15,3,4,100,5,130,30,30,"Melee","MeleeAttack",11001,0,0,0,"맹독사2","마법 생물",2,"근접",null,10013,"메두사1","보스 몬스터",13,"근접","MeleeAttack_Claw",null,"MeleeAttack_Claw"]
[14021,114021,"Normal_Melee",14021,14021,1,3,0,2.15,3,5,100,5,130,30,30,"Melee","MeleeAttack",11001,0,0,0,"슬라임1","마법 생물",2,"근접",null,10014,"바포메트2","보스 몬스터",14,"원거리",null,null,"Projectile 19 sun"]
[14024,114024,"Normal_Melee",14024,14024,1,3,0,2,2,5,100,5,130,30,30,"Melee","MeleeAttack",11001,0,0,0,"임프2","마법 생물",2,"근접",null,10015,"트롤 워리어4","보스 몬스터",15,"근접","MeleeAttack_Blunt",null,"MeleeAttack_Blunt"]
[10003,110003,"Boss_Range",10003,10003,21,42,16,1.6,6,9,100,18,150,34,34,"Melee","MeleeAttack",11001,0,0,0,"임프전사1","보스 몬스터",3,"보스-원거리",null,10016,"흑기사3","보스 몬스터",16,"근접","MeleeAttack_Sword",null,"MeleeAttack_Sword"]
[11008,111008,"Normal_Range",11008,11008,1,2,0,2.8,4,6,100,8,120,30,30,"Range","Projectile 4 yellow arrow",11001,0,0,0,"놀아처3","수인형 몬스터",3,"원거리",null,10017,"흡혈귀여왕2","보스 몬스터",17,"원거리",null,null,"2D Projectile 27 heart"]
[11013,111013,"Normal_Melee",11013,11013,2,6,1,2.6,3,7,100,5,130,30,30,"Melee","MeleeAttack",11001,0,0,0,"미노타우로스 도살자1","수인형 몬스터",3,"근접",null,10018,"에티4","보스 몬스터",18,"근접","MeleeAttack_Blunt",null,"MeleeAttack_Blunt"]
[11030,111030,"Normal_Melee",11030,11030,2,5,0,2.75,2,9,100,5,130,30,30,"Melee","MeleeAttack",11001,0,0,0,"트롤2","수인형 몬스터",3,"근접",null,10019,"레드드래곤3","보스 몬스터",19,"근접","MeleeAttack_Claw",null,"MeleeAttack_Claw"]
[11031,111031,"Normal_Melee",11031,11031,2,5,0,2.9,2,9,100,5,130,30,30,"Melee","MeleeAttack",11001,0,0,0,"트롤3","수인형 몬스터",3,"근접",null,10020,"메두사2","보스 몬스터",20,"원거리",null,null,"vfx_ToonProjectile_Plasma03Purple"]
[14014,114014,"Normal_Melee",14014,14014,2,5,0,2.25,2,7,100,5,130,30,30,"Melee","MeleeAttack",11001,0,0,0,"동굴쥐2","마법 생물",3,"근접",null,10021,"흑기사1","보스 몬스터",21,"근접","MeleeAttack_Sword",null,"MeleeAttack_Sword"]
[14022,114022,"Normal_Melee",14022,14022,3,6,0,2.25,3,7,100,5,130,30,30,"Melee","MeleeAttack",11001,0,0,0,"슬라임2","마법 생물",3,"근접",null,10022,"용암골렘2","보스 몬스터",22,"근접","MeleeAttack_Blunt",null,"MeleeAttack_Blunt"]
[10004,110004,"Boss_Range",10004,10004,56,112,0,2.6,7,30,100,15,200,31,31,"Melee","MeleeAttack",11001,0,0,0,"오우거1","보스 몬스터",4,"보스 근접",null,10023,"레드드래곤1","보스 몬스터",23,"근접","MeleeAttack_Claw",null,"MeleeAttack_Claw"]
[11009,111009,"Normal_Melee",11009,11009,3,7,1,2.9,4,9,100,5,130,30,30,"Melee","MeleeAttack",11001,0,0,0,"미노타우르스 광전사1","수인형 몬스터",4,"근접",null,10024,"바포메트7","보스 몬스터",24,"원거리",null,null,"Projectile 20 black"]
[11025,111025,"Normal_Range",11025,11025,1,3,0,2.7,4,8,100,3,150,30,30,"Range","vfx_ToonProjectile_Bomb03Red",11001,0,0,0,"싸이클롭스2","수인형 몬스터",4,"원거리",null,10025,"거미여왕1","보스 몬스터",25,"원거리",null,null,"vfx_ToonProjectile_Fireball01Green"]
[10005,110005,"Boss_Range",10005,10005,26,53,66,1.6,7,11,100,10,150,35,35,"Range","Projectile 8 emergy",11001,0,0,0,"바포메트6","보스 몬스터",5,"보스-원거리",null,10026,"데스나이트1","보스 몬스터",26,"근접","MeleeAttack_Sword",null,"MeleeAttack_Sword"]
[11006,111006,"Normal_Melee",11006,11006,3,6,0,2.1,3,7,100,5,130,30,30,"Melee","MeleeAttack",11001,0,0,0,"놀강도4","수인형 몬스터",5,"근접",null,10027,"레드드래곤4","보스 몬스터",27,"원거리",null,null,"vfx_ToonProjectile_Bomb02Red"]
[11029,111029,"Normal_Melee",11029,11029,4,8,0,2.8,3,10,100,5,130,30,30,"Melee","MeleeAttack",11001,0,0,0,"트롤1","수인형 몬스터",5,"근접",null,10028,"타락한 천사","보스 몬스터",28,"근접","MeleeAttack_Scythe",null,"MeleeAttack_Scythe"]
[12028,112028,"Normal_Range",12028,12028,2,4,0,2.6,3,9,100,3,120,30,30,"Range","Projectile 12 cuts",11001,0,0,0,"오크 궁수1","인간형 몬스터",5,"원거리",null,11001,"놀1","수인형 몬스터",1,"근접","MeleeAttack_Dagger",null,"MeleeAttack_Dagger"]
[12032,112032,"Normal_Melee",12032,12032,4,8,0,2.5,3,8,100,5,130,30,30,"Melee","MeleeAttack",11001,0,0,0,"오크1","인간형 몬스터",5,"근접",null,11002,"놀2","수인형 몬스터",1,"근접","MeleeAttack_Sword",null,"MeleeAttack_Sword"]
[13014,113014,"Normal_Melee",13014,13014,4,8,0,2.2000000000000002,4,6,100,5,130,30,30,"Melee","MeleeAttack",11001,0,0,0,"사악한 악령1","언데드형 몬스터",5,"근접",null,11003,"놀3","수인형 몬스터",2,"근접","MeleeAttack_Sword",null,"MeleeAttack_Sword"]
[10006,110006,"Boss_Melee",10006,10006,29,58,72,1.4,7,10,100,10,150,35,35,"Range","vfx_ToonProjectile_Fireball01Purple",11001,0,0,0,"거미여왕2","보스 몬스터",6,"보스 근접",null,11004,"놀강도1","수인형 몬스터",6,"근접","MeleeAttack_DoubleSword",null,"MeleeAttack_DoubleSword"]
[11004,111004,"Normal_Melee",11004,11004,5,10,0,1.1000000000000001,3,5,100,5,130,30,30,"Melee","MeleeAttack",11001,0,0,0,"놀강도1","수인형 몬스터",6,"근접",null,11005,"놀강도3","수인형 몬스터",2,"근접","MeleeAttack_DoubleSword",null,"MeleeAttack_DoubleSword"]
[12031,112031,"Normal_Range",12031,12031,2,5,0,2.85,7,8,100,3,120,30,30,"Range","vfx_Projectile_Orb09_BluePurple",11001,0,0,0,"오크 마법사2","인간형 몬스터",6,"원거리",null,11006,"놀강도4","수인형 몬스터",5,"근접","MeleeAttack_DoubleSword",null,"MeleeAttack_DoubleSword"]
[12033,112033,"Normal_Melee",12033,12033,5,10,0,2.6,5,9,100,5,130,30,30,"Melee","MeleeAttack",11001,0,0,0,"오크2","인간형 몬스터",6,"근접",null,11007,"놀아처2","수인형 몬스터",1,"원거리",null,null,"Projectile 12 cuts"]
[14012,114012,"Normal_Melee",14012,14012,5,10,0,2.2000000000000002,2,10,100,5,130,30,30,"Melee","MeleeAttack",11001,0,0,0,"데스웜","마법 생물",6,"근접",null,11008,"놀아처3","수인형 몬스터",3,"원거리",null,null,"Projectile 4 yellow arrow"]
[10007,110007,"Boss_Range",10007,10007,33,66,52,1.6,8,15,100,10,150,35,35,"Melee","MeleeAttack",11001,0,0,0,"흑기사2","보스 몬스터",7,"보스 근접",null,11009,"미노타우르스 광전사1","수인형 몬스터",4,"근접","MeleeAttack_Axe",null,"MeleeAttack_Axe"]
[11024,111024,"Normal_Range",11024,11024,3,6,0,2.8,4,12,100,3,150,30,30,"Range","vfx_ToonProjectile_Bomb03Orange",11001,0,0,0,"싸이클롭스1","수인형 몬스터",7,"원거리",null,11010,"미노타우르스 광전사2","수인형 몬스터",10,"근접","MeleeAttack_Axe",null,"MeleeAttack_Axe"]
[12029,112029,"Normal_Range",12029,12029,3,6,0,2.7,6,9,100,3,120,30,30,"Range","2D Projectile 21 red arrow",11001,0,0,0,"오크 궁수2","인간형 몬스터",7,"원거리",null,11011,"미노타우르스 광전사3","수인형 몬스터",10,"근접","MeleeAttack_Axe",null,"MeleeAttack_Axe"]
[12030,112030,"Normal_Range",12030,12030,3,6,0,2.8,5,11,100,3,120,30,30,"Range","vfx_Projectile_Orb09_OrangePurple",11001,0,0,0,"오크 마법사1","인간형 몬스터",7,"원거리",null,11012,"미노타우르스 광전사4","수인형 몬스터",8,"근접","MeleeAttack_Axe",null,"MeleeAttack_Axe"]
[10008,110008,"Boss_Melee",10008,10008,42,85,0,1.2,7,9,100,25,180,38,38,"Melee","MeleeAttack",11001,0,0,0,"늑대인간","보스 몬스터",8,null,null,11013,"미노타우로스 도살자1","수인형 몬스터",3,"근접","MeleeAttack_Axe",null,"MeleeAttack_Axe"]
[11012,111012,"Normal_Melee",11012,11012,6,14,3,2.4,5,9,100,5,130,30,30,"Melee","MeleeAttack",11001,0,0,0,"미노타우르스 광전사4","수인형 몬스터",8,"근접",null,11014,"미노타우로스 도살자2","수인형 몬스터",8,"근접","MeleeAttack_Axe",null,"MeleeAttack_Axe"]
[11014,111014,"Normal_Melee",11014,11014,6,14,3,3,6,11,100,5,130,30,30,"Melee","MeleeAttack",11001,0,0,0,"미노타우로스 도살자2","수인형 몬스터",8,"근접",null,11015,"미노타우르스 챔피언1","수인형 몬스터",23,"근접","MeleeAttack_Axe",null,"MeleeAttack_Axe"]
[11018,111018,"Normal_Melee",11018,11018,6,13,3,2.9,9,11,100,5,130,30,30,"Melee","MeleeAttack",11001,0,0,0,"미노타우르스 챔피언4","수인형 몬스터",8,"근접",null,11016,"미노타우르스 챔피언2","수인형 몬스터",23,"근접","MeleeAttack_Axe",null,"MeleeAttack_Axe"]
[11019,111019,"Normal_Melee",11019,11019,6,13,42,2.85,8,12,100,5,130,30,30,"Melee","MeleeAttack",11001,0,0,0,"미노타우르스 챔피언5","수인형 몬스터",8,"근접",null,11017,"미노타우르스 챔피언3","수인형 몬스터",11,"근접","MeleeAttack_Axe",null,"MeleeAttack_Axe"]
[12036,112036,"Normal_Range",12036,12036,3,6,0,2.5,7,13,100,3,120,30,30,"Range","Projectile 12 cuts",11001,0,0,0,"활든 강도2","인간형 몬스터",8,"원거리",null,11018,"미노타우르스 챔피언4","수인형 몬스터",8,"근접","MeleeAttack_Axe",null,"MeleeAttack_Axe"]
[10009,110009,"Boss_Melee",10009,10009,44,88,60,2.15,12,20,100,15,180,30,30,"Melee","MeleeAttack",11001,0,0,0,"대사탄1","보스 몬스터",9,null,null,11019,"미노타우르스 챔피언5","수인형 몬스터",8,"근접","MeleeAttack_Axe",null,"MeleeAttack_Axe"]
[11021,111021,"Normal_Melee",11021,11021,7,14,0,3.3,11,13,100,5,130,30,30,"Melee","MeleeAttack",11001,0,0,0,"버그베어2","수인형 몬스터",9,"근접",null,11020,"버그베어1","수인형 몬스터",24,"근접","MeleeAttack_Blunt",null,"MeleeAttack_Blunt"]
[11022,111022,"Normal_Melee",11022,11022,7,14,0,3.3,11,14,100,5,130,30,30,"Melee","MeleeAttack",11001,0,0,0,"버그베어3","수인형 몬스터",9,"근접",null,11021,"버그베어2","수인형 몬스터",9,"근접","MeleeAttack_Blunt",null,"MeleeAttack_Blunt"]
[11023,111023,"Normal_Melee",11023,11023,7,14,0,3.1,9,15,100,5,130,30,30,"Melee","MeleeAttack",11001,0,0,0,"버그베어4","수인형 몬스터",9,"근접",null,11022,"버그베어3","수인형 몬스터",9,"근접","MeleeAttack_Blunt",null,"MeleeAttack_Blunt"]
[12017,112017,"Normal_Range",12017,12017,3,7,17,2.7,7,11,100,3,120,30,30,"Range","vfx_Projectile_Orb02_Pink",11001,0,0,0,"다크엘프 마법사1","인간형 몬스터",9,"원거리",null,11023,"버그베어4","수인형 몬스터",9,"근접","MeleeAttack_Blunt",null,"MeleeAttack_Blunt"]
[12025,112025,"Normal_Melee",12025,12025,7,14,0,0.85,3,6,100,5,130,30,30,"Melee","MeleeAttack",11001,0,0,0,"연쇄살인마1","인간형 몬스터",9,"근접",null,11024,"싸이클롭스1","수인형 몬스터",7,"원거리",null,null,"vfx_ToonProjectile_Bomb03Orange"]
[10010,110010,"Boss_Melee",10010,10010,17,35,282,2.8,18,20,100,30,200,36,36,"Range","Projectile 7 wind",11001,0,0,0,"다크엘프 아처1","보스 몬스터",10,null,null,11025,"싸이클롭스2","수인형 몬스터",4,"원거리",null,null,"vfx_ToonProjectile_Bomb03Red"]
[11010,111010,"Normal_Melee",11010,11010,8,18,4,2.6,10,12,100,5,130,30,30,"Melee","MeleeAttack",11001,0,0,0,"미노타우르스 광전사2","수인형 몬스터",10,"근접",null,11026,"싸이클롭스3","수인형 몬스터",16,"원거리",null,null,"vfx_ToonProjectile_Bomb03Blue"]
[11011,111011,"Normal_Melee",11011,11011,8,18,4,2.25,8,11,100,5,130,30,30,"Melee","MeleeAttack",11001,0,0,0,"미노타우르스 광전사3","수인형 몬스터",10,"근접",null,11027,"예티1","수인형 몬스터",17,"근접","YellowSwordBeamHit",null,"YellowSwordBeamHit"]
[12024,112024,"Normal_Melee",12024,12024,8,16,0,1.85,7,9,100,5,150,30,30,"Melee","MeleeAttack",11001,0,0,0,"살인 청부업자3","인간형 몬스터",10,"근접",null,11028,"예티2","수인형 몬스터",17,"근접","YellowSwordBeamHit",null,"YellowSwordBeamHit"]
[12037,112037,"Normal_Range",12037,12037,4,8,0,2.4500000000000002,7,21,100,3,120,30,30,"Range","Projectile 4 yellow arrow",11001,0,0,0,"활든 강도3","인간형 몬스터",10,"원거리",null,11029,"트롤1","수인형 몬스터",5,"근접","MeleeAttack_Blunt",null,"MeleeAttack_Blunt"]
[10011,110011,"Boss_Melee",10011,10011,51,102,72,2.0499999999999998,13,21,100,15,180,30,30,"Melee","MeleeAttack",11001,0,0,0,"대사탄2","보스 몬스터",11,null,null,11030,"트롤2","수인형 몬스터",3,"근접","MeleeAttack_Blunt",null,"MeleeAttack_Blunt"]
[11017,111017,"Normal_Melee",11017,11017,9,18,4,2.65,12,18,100,5,130,30,30,"Melee","MeleeAttack",11001,0,0,0,"미노타우르스 챔피언3","수인형 몬스터",11,"근접",null,11031,"트롤3","수인형 몬스터",3,"근접","MeleeAttack_Blunt",null,"MeleeAttack_Blunt"]
[12013,112013,"Normal_Melee",12013,12013,9,18,0,3.35,14,16,100,5,150,30,30,"Melee","MeleeAttack",11001,0,0,0,"광전사6","인간형 몬스터",11,"근접",null,12001,"강도1","인간형 몬스터",22,"근접","MeleeAttack_Sword",null,"MeleeAttack_Sword"]
[12023,112023,"Normal_Melee",12023,12023,9,18,0,1.65,7,8,100,5,150,30,30,"Melee","MeleeAttack",11001,0,0,0,"살인 청부업자2","인간형 몬스터",11,"근접",null,12002,"강도2","인간형 몬스터",22,"근접","MeleeAttack_Sword",null,"MeleeAttack_Sword"]
[12027,112027,"Normal_Melee",12027,12027,9,18,0,0.9,5,7,100,5,130,30,30,"Melee","MeleeAttack",11001,0,0,0,"연쇄살인마3","인간형 몬스터",11,"근접",null,12003,"강도3","인간형 몬스터",22,"근접","MeleeAttack_Sword",null,"MeleeAttack_Sword"]
[13017,113017,"Normal_Range",13017,13017,4,9,0,2.85,12,15,100,3,120,30,30,"Range","vfx_Projectile_Orb15_DarkRed",11001,0,0,0,"악마 광신자2","언데드형 몬스터",11,"원거리",null,12004,"고블린1","인간형 몬스터",12,"근접","MeleeAttack_Dagger",null,"MeleeAttack_Dagger"]
[10012,110012,"Boss_Melee",10012,10012,48,97,77,1.5,13,14,100,33,150,37,37,"Melee","MeleeAttack",11001,0,0,0,"데스나이트3","보스 몬스터",12,null,null,12005,"고블린 라이더1","인간형 몬스터",12,"근접","MeleeAttack_Scythe",null,"MeleeAttack_Scythe"]
[12004,112004,"Normal_Melee",12004,12004,9,19,0,1.7,8,10,100,5,130,30,30,"Melee","MeleeAttack",11001,0,0,0,"고블린1","인간형 몬스터",12,"근접",null,12006,"고블린 라이더2","인간형 몬스터",12,"근접","MeleeAttack_Scythe",null,"MeleeAttack_Scythe"]
[12005,112005,"Normal_Melee",12005,12005,9,19,0,2,7,14,100,5,130,30,30,"Melee","MeleeAttack",11001,0,0,0,"고블린 라이더1","인간형 몬스터",12,"근접",null,12007,"고블린 아처1","인간형 몬스터",12,"원거리",null,null,"vfx_ToonProjectile_Bullet01Green"]
[12006,112006,"Normal_Melee",12006,12006,9,19,0,2.1,7,15,100,5,130,30,30,"Melee","MeleeAttack",11001,0,0,0,"고블린 라이더2","인간형 몬스터",12,"근접",null,12008,"광전사1","인간형 몬스터",15,"근접","MeleeAttack_Axe",null,"MeleeAttack_Axe"]
[12007,112007,"Normal_Range",12007,12007,5,10,0,2.4,11,13,100,3,120,30,30,"Range","vfx_ToonProjectile_Bullet01Green",11001,0,0,0,"고블린 아처1","인간형 몬스터",12,"원거리",null,12009,"광전사2","인간형 몬스터",24,"근접","MeleeAttack_Axe",null,"MeleeAttack_Axe"]
[10013,110013,"Boss_Range",10013,10013,42,84,223,1.5,14,16,100,10,150,37,37,"Melee","MeleeAttack",11001,0,0,0,"메두사1","보스 몬스터",13,null,null,12010,"광전사3","인간형 몬스터",15,"근접","MeleeAttack_Axe",null,"MeleeAttack_Axe"]
[13001,113001,"Normal_Range",13001,13001,5,10,0,2.9,16,22,100,3,120,30,30,"Range","vfx_Projectile_Fireball07_Blue",11001,0,0,0,"네크로멘서1","언데드형 몬스터",13,"원거리",null,12011,"광전사4","인간형 몬스터",24,"근접","MeleeAttack_Axe",null,"MeleeAttack_Axe"]
[13004,113004,"Normal_Melee",13004,13004,10,21,0,2.2999999999999998,8,16,100,5,130,30,30,"Melee","MeleeAttack",11001,0,0,0,"데스1","언데드형 몬스터",13,"근접",null,12012,"광전사5","인간형 몬스터",15,"근접","MeleeAttack_Axe",null,"MeleeAttack_Axe"]
[13007,113007,"Normal_Melee",13007,13007,10,21,0,2.4,12,13,100,5,130,30,30,"Melee","MeleeAttack",11001,0,0,0,"머미1","언데드형 몬스터",13,"근접",null,12013,"광전사6","인간형 몬스터",11,"근접","MeleeAttack_Axe",null,"MeleeAttack_Axe"]
[13015,113015,"Normal_Melee",13015,13015,10,21,0,2.15,10,13,100,5,130,30,30,"Melee","MeleeAttack",11001,0,0,0,"사악한 악령2","언데드형 몬스터",13,"근접",null,12014,"다크엘프 기사2","인간형 몬스터",25,"근접","MeleeAttack_Sword",null,"MeleeAttack_Sword"]
[13023,113023,"Normal_Melee",13023,13023,10,21,0,1.9,9,12,100,5,130,30,30,"Melee","MeleeAttack",11001,0,0,0,"임프 사역마1","언데드형 몬스터",13,"근접",null,12015,"다크엘프 기사3","인간형 몬스터",25,"근접","MeleeAttack_Sword",null,"MeleeAttack_Sword"]
[10014,110014,"Boss_Range",10014,10014,53,106,108,1.625,16,28,100,10,150,37,37,"Range","Projectile 19 sun",11001,0,0,0,"바포메트2","보스 몬스터",14,null,null,12016,"다크엘프 기사4","인간형 몬스터",23,"근접","MeleeAttack_Sword",null,"MeleeAttack_Sword"]
[13002,113002,"Normal_Range",13002,13002,5,11,0,2.85,20,22,100,3,120,30,30,"Range","vfx_Projectile_Fireball07_Orange",11001,0,0,0,"네크로멘서2","언데드형 몬스터",14,"원거리",null,12017,"다크엘프 마법사1","인간형 몬스터",9,"원거리",null,null,"vfx_Projectile_Orb02_Pink"]
[13005,113005,"Normal_Melee",13005,13005,11,22,0,2.35,14,15,100,5,130,30,30,"Melee","MeleeAttack",11001,0,0,0,"데스2","언데드형 몬스터",14,"근접",null,12018,"다크엘프 마법사3","인간형 몬스터",24,"원거리",null,null,"vfx_Projectile_Orb06_Purple"]
[13008,113008,"Normal_Melee",13008,13008,11,22,0,2.4500000000000002,11,19,100,5,130,30,30,"Melee","MeleeAttack",11001,0,0,0,"머미2","언데드형 몬스터",14,"근접",null,12019,"다크엘프 마법사4","인간형 몬스터",17,"원거리",null,null,"vfx_Projectile_Orb05_Purple"]
[13026,113026,"Normal_Melee",13026,13026,11,22,0,2.25,12,16,100,5,130,30,30,"Melee","MeleeAttack",11001,0,0,0,"타락한 기사2","언데드형 몬스터",14,"근접",null,12020,"도살자1","인간형 몬스터",17,"근접","MeleeAttack_Axe",null,"MeleeAttack_Axe"]
[10015,110015,"Boss_Range",10015,10015,69,138,0,3,19,45,100,33,200,33,33,"Melee","MeleeAttack",11001,0,0,0,"트롤 워리어4","보스 몬스터",15,null,null,12021,"도살자2","인간형 몬스터",18,"근접","MeleeAttack_Axe",null,"MeleeAttack_Axe"]
[12008,112008,"Normal_Melee",12008,12008,12,24,0,3.1,13,28,100,5,150,30,30,"Melee","MeleeAttack",11001,0,0,0,"광전사1","인간형 몬스터",15,"근접",null,12022,"살인 청부업자1","인간형 몬스터",18,"근접","MeleeAttack_Sword",null,"MeleeAttack_Sword"]
[12010,112010,"Normal_Melee",12010,12010,12,24,0,3.35,22,23,100,5,150,30,30,"Melee","MeleeAttack",11001,0,0,0,"광전사3","인간형 몬스터",15,"근접",null,12023,"살인 청부업자2","인간형 몬스터",11,"근접","MeleeAttack_DoubleSword",null,"MeleeAttack_DoubleSword"]
[12012,112012,"Normal_Melee",12012,12012,12,24,0,3.3,18,26,100,5,150,30,30,"Melee","MeleeAttack",11001,0,0,0,"광전사5","인간형 몬스터",15,"근접",null,12024,"살인 청부업자3","인간형 몬스터",10,"근접","MeleeAttack_Sword",null,"MeleeAttack_Sword"]
[13003,113003,"Normal_Range",13003,13003,6,12,0,2.95,21,24,100,3,120,30,30,"Range","vfx_Projectile_Fireball07_Purple",11001,0,0,0,"네크로멘서3","언데드형 몬스터",15,"원거리",null,12025,"연쇄살인마1","인간형 몬스터",9,"근접","MeleeAttack_DoubleSword",null,"MeleeAttack_DoubleSword"]
[13019,113019,"Normal_Range",13019,13019,6,12,0,2.75,17,20,100,3,120,30,30,"Range","vfx_Projectile_Orb07_Purple",11001,0,0,0,"악마 광신자4","언데드형 몬스터",15,"원거리",null,12026,"연쇄살인마2","인간형 몬스터",22,"근접","MeleeAttack_Dagger",null,"MeleeAttack_Dagger"]
[10016,110016,"Boss_Range",10016,10016,60,121,100,2.35,26,34,100,10,150,37,37,"Melee","MeleeAttack",11001,0,0,0,"흑기사3","보스 몬스터",16,null,null,12027,"연쇄살인마3","인간형 몬스터",11,"근접","MeleeAttack_Dagger",null,"MeleeAttack_Dagger"]
[11026,111026,"Normal_Range",11026,11026,6,13,0,2.9,9,35,100,3,150,30,30,"Range","vfx_ToonProjectile_Bomb03Blue",11001,0,0,0,"싸이클롭스3","수인형 몬스터",16,"원거리",null,12028,"오크 궁수1","인간형 몬스터",5,"원거리",null,null,"Projectile 12 cuts"]
[13028,113028,"Normal_Range",13028,13028,6,13,0,2.85,18,25,100,3,120,30,30,"Range","Projectile 4 yellow arrow",11001,0,0,0,"해골 궁수","언데드형 몬스터",16,"원거리",null,12029,"오크 궁수2","인간형 몬스터",7,"원거리",null,null,"2D Projectile 21 red arrow"]
[13029,113029,"Normal_Melee",13029,13029,13,26,0,2.6,18,21,100,5,130,30,30,"Melee","MeleeAttack",11001,0,0,0,"해골 근위병","언데드형 몬스터",16,"근접",null,12030,"오크 마법사1","인간형 몬스터",7,"원거리",null,null,"vfx_Projectile_Orb09_OrangePurple"]
[13031,113031,"Normal_Melee",13031,13031,13,26,0,2.4,17,19,100,5,130,30,30,"Melee","MeleeAttack",11001,0,0,0,"해골 기사1","언데드형 몬스터",16,"근접",null,12031,"오크 마법사2","인간형 몬스터",6,"원거리",null,null,"vfx_Projectile_Orb09_BluePurple"]
[14027,114027,"Normal_Range",14027,14027,6,13,0,2.7,18,23,100,3,120,30,30,"Range","Projectile 3 black fire",11001,0,0,0,"임프 마법사1","마법 생물",16,"원거리",null,12032,"오크1","인간형 몬스터",5,"근접","MeleeAttack_Axe",null,"MeleeAttack_Axe"]
[10017,110017,"Boss_Range",10017,10017,45,91,315,1.6,20,23,100,12,150,38,38,"Range","2D Projectile 27 heart",11001,0,0,0,"흡혈귀여왕2","보스 몬스터",17,null,null,12033,"오크2","인간형 몬스터",6,"근접","MeleeAttack_Axe",null,"MeleeAttack_Axe"]
[11027,111027,"Normal_Melee",11027,11027,13,32,0,2.5,10,30,100,5,130,30,30,"Melee","MeleeAttack",11001,0,0,0,"예티1","수인형 몬스터",17,"근접",null,12034,"오크 워리어1","인간형 몬스터",24,"근접","MeleeAttack_Blunt",null,"MeleeAttack_Blunt"]
[11028,111028,"Normal_Melee",11028,11028,13,32,0,2.65,14,28,100,5,130,30,30,"Melee","MeleeAttack",11001,0,0,0,"예티2","수인형 몬스터",17,"근접",null,12035,"활든 강도1","인간형 몬스터",24,"원거리",null,null,"Projectile 21 red arrow"]
[12019,112019,"Normal_Range",12019,12019,7,14,35,2.65,20,23,100,3,120,30,30,"Range","vfx_Projectile_Orb05_Purple",11001,0,0,0,"다크엘프 마법사4","인간형 몬스터",17,"원거리",null,12036,"활든 강도2","인간형 몬스터",8,"원거리",null,null,"Projectile 12 cuts"]
[12020,112020,"Normal_Melee",12020,12020,13,27,0,2.9,23,24,100,5,130,30,30,"Melee","MeleeAttack",11001,0,0,0,"도살자1","인간형 몬스터",17,"근접",null,12037,"활든 강도3","인간형 몬스터",10,"원거리",null,null,"Projectile 4 yellow arrow"]
[13024,113024,"Normal_Melee",13024,13024,13,27,0,1.95,13,18,100,5,130,30,30,"Melee","MeleeAttack",11001,0,0,0,"임프 사역마2","언데드형 몬스터",17,"근접",null,13001,"네크로멘서1","언데드형 몬스터",13,"원거리",null,null,"vfx_Projectile_Fireball07_Blue"]
[10018,110018,"Boss_Range",10018,10018,79,158,0,2.8,30,45,100,15,200,33,33,"Melee","MeleeAttack",11001,0,0,0,"에티4","보스 몬스터",18,null,null,13002,"네크로멘서2","언데드형 몬스터",14,"원거리",null,null,"vfx_Projectile_Fireball07_Orange"]
[12021,112021,"Normal_Melee",12021,12021,14,29,0,2.8,22,24,100,5,130,30,30,"Melee","MeleeAttack",11001,0,0,0,"도살자2","인간형 몬스터",18,"근접",null,13003,"네크로멘서3","언데드형 몬스터",15,"원거리",null,null,"vfx_Projectile_Fireball07_Purple"]
[12022,112022,"Normal_Melee",12022,12022,14,29,0,1.7,9,19,100,5,130,30,30,"Melee","MeleeAttack",11001,0,0,0,"살인 청부업자1","인간형 몬스터",18,"근접",null,13004,"데스1","언데드형 몬스터",13,"근접","MeleeAttack_Scythe",null,"MeleeAttack_Scythe"]
[13025,113025,"Normal_Melee",13025,13025,14,29,0,2.2000000000000002,16,20,100,5,130,30,30,"Melee","MeleeAttack",11001,0,0,0,"타락한 기사1","언데드형 몬스터",18,"근접",null,13005,"데스2","언데드형 몬스터",14,"근접","MeleeAttack_Scythe",null,"MeleeAttack_Scythe"]
[14007,114007,"Normal_Melee",14007,14007,14,29,0,2,16,17,100,5,130,30,30,"Melee","MeleeAttack",11001,0,0,0,"구울1","마법 생물",18,"근접",null,13006,"데스나이트2","언데드형 몬스터",23,"근접","MeleeAttack_Sword",null,"MeleeAttack_Sword"]
[10019,110019,"Boss_Melee",10019,10019,71,142,111,2.4,20,48,100,15,200,32,32,"Melee","MeleeAttack",11001,0,0,0,"레드드래곤3","보스 몬스터",19,null,null,13007,"머미1","언데드형 몬스터",13,"근접","MeleeAttack_Blow",null,"MeleeAttack_Blow"]
[14008,114008,"Normal_Melee",14008,14008,15,30,0,1.95,12,22,100,5,130,30,30,"Melee","MeleeAttack",11001,0,0,0,"구울2","마법 생물",19,"근접",null,13008,"머미2","언데드형 몬스터",14,"근접","MeleeAttack_Blow",null,"MeleeAttack_Blow"]
[14009,114009,"Normal_Melee",14009,14009,15,30,0,1.95,9,25,100,5,130,30,30,"Melee","MeleeAttack",11001,0,0,0,"구울3","마법 생물",19,"근접",null,13009,"머미3","언데드형 몬스터",25,"근접","MeleeAttack_Blow",null,"MeleeAttack_Blow"]
[14010,114010,"Normal_Melee",14010,14010,15,30,0,1.8,15,16,100,15,130,30,30,"Melee","MeleeAttack",11001,0,0,0,"다이어울프1","마법 생물",19,"근접",null,13010,"바포메트1","언데드형 몬스터",25,"원거리",null,null,"vfx_Projectile_Orb13_DarkPurple"]
[14011,114011,"Normal_Melee",14011,14011,15,30,0,1.9,15,18,100,15,130,30,30,"Melee","MeleeAttack",11001,0,0,0,"다이어울프2","마법 생물",19,"근접",null,13011,"바포메트3","언데드형 몬스터",32,"원거리",null,null,"vfx_Projectile_Orb13_DarkRed"]
[14029,114029,"Normal_Range",14029,14029,7,15,0,2.65,18,28,100,3,120,30,30,"Range","Projectile 16 fire",11001,0,0,0,"임프 마법사3","마법 생물",19,"원거리",null,13012,"바포메트4","언데드형 몬스터",26,"원거리",null,null,"vfx_Projectile_Orb14_Yellow"]
[14032,114032,"Normal_Melee",14032,14032,15,30,0,2.1,14,22,100,5,130,30,30,"Melee","MeleeAttack",11001,0,0,0,"임프 전사3","마법 생물",19,"근접",null,13013,"바포메트5","언데드형 몬스터",31,"원거리",null,null,"vfx_Projectile_Orb14_Red"]
[10020,110020,"Boss_Range",10020,10020,59,118,230,1.625,25,28,100,10,150,38,38,"Range","vfx_ToonProjectile_Plasma03Purple",11001,0,0,0,"메두사2","보스 몬스터",20,null,null,13014,"사악한 악령1","언데드형 몬스터",5,"근접","MeleeAttack_Claw",null,"MeleeAttack_Claw"]
[14023,114023,"Normal_Melee",14023,14023,16,32,0,1.95,15,21,100,5,130,30,30,"Melee","MeleeAttack",11001,0,0,0,"임프1","마법 생물",20,"근접",null,13015,"사악한 악령2","언데드형 몬스터",13,"근접","MeleeAttack_Claw",null,"MeleeAttack_Claw"]
[14025,114025,"Normal_Melee",14025,14025,16,32,0,1.95,12,24,100,5,130,30,30,"Melee","MeleeAttack",11001,0,0,0,"임프3","마법 생물",20,"근접",null,13016,"악마 광신자1","언데드형 몬스터",30,"원거리",null,null,"vfx_Projectile_Orb15_DarkBlue"]
[14030,114030,"Normal_Range",14030,14030,8,16,0,2.6,23,26,100,3,120,30,30,"Range","Projectile 4 fire",11001,0,0,0,"임프 마법사4","마법 생물",20,"원거리",null,13017,"악마 광신자2","언데드형 몬스터",11,"원거리",null,null,"vfx_Projectile_Orb15_DarkRed"]
[14031,114031,"Normal_Melee",14031,14031,16,32,0,2.0499999999999998,16,22,100,5,130,30,30,"Melee","MeleeAttack",11001,0,0,0,"임프 전사2","마법 생물",20,"근접",null,13018,"악마 광신자3","언데드형 몬스터",23,"원거리",null,null,"vfx_Projectile_Orb15_DarkOrange"]
[14034,114034,"Normal_Melee",14034,14034,17,34,0,2.15,18,25,100,5,130,30,30,"Melee","MeleeAttack",11001,0,0,0,"흡혈귀1","마법 생물",20,"근접",null,13019,"악마 광신자4","언데드형 몬스터",15,"원거리",null,null,"vfx_Projectile_Orb07_Purple"]
[10021,110021,"Boss_Range",10021,10021,74,149,120,2.2999999999999998,36,45,100,10,150,38,38,"Melee","MeleeAttack",11001,0,0,0,"흑기사1","보스 몬스터",21,null,null,13020,"악마 추종자1","언데드형 몬스터",22,"근접","MeleeAttack_Dagger",null,"MeleeAttack_Dagger"]
[13032,113032,"Normal_Melee",13032,13032,17,34,0,2.35,11,36,100,5,130,30,30,"Melee","MeleeAttack",11001,0,0,0,"해골 기사2","언데드형 몬스터",21,"근접",null,13021,"악마 추종자2","언데드형 몬스터",26,"근접","MeleeAttack_Claw",null,"MeleeAttack_Claw"]
[12001,112001,"Normal_Melee",12001,12001,17,34,0,1.2999999999999998,17,18,100,10,130,30,30,"Melee","MeleeAttack",11001,0,0,0,"강도1","인간형 몬스터",21,"근접",null,13022,"악마 추종자3","언데드형 몬스터",26,"근접","MeleeAttack_Dagger",null,"MeleeAttack_Dagger"]
[12002,112002,"Normal_Melee",12002,12002,17,34,0,1.4500000000000002,16,22,100,10,130,30,30,"Melee","MeleeAttack",11001,0,0,0,"강도2","인간형 몬스터",21,"근접",null,13023,"임프 사역마1","언데드형 몬스터",13,"근접","MeleeAttack_Blow",null,"MeleeAttack_Blow"]
[12003,112003,"Normal_Melee",12003,12003,17,35,0,1.4,17,20,100,10,130,30,30,"Melee","MeleeAttack",11001,0,0,0,"강도3","인간형 몬스터",21,"근접",null,13024,"임프 사역마2","언데드형 몬스터",17,"근접","MeleeAttack_Blow",null,"MeleeAttack_Blow"]
[10022,110022,"Boss_Range",10022,10022,31,63,525,2.8,33,62,100,15,200,30,30,"Melee","MeleeAttack",11001,0,0,0,"용암골렘2","보스 몬스터",22,null,null,13025,"타락한 기사1","언데드형 몬스터",18,"근접","MeleeAttack_Sword",null,"MeleeAttack_Sword"]
[12026,112026,"Normal_Melee",12026,12026,17,35,0,0.9,11,16,100,5,130,30,30,"Melee","MeleeAttack",11001,0,0,0,"연쇄살인마2","인간형 몬스터",22,"근접",null,13026,"타락한 기사2","언데드형 몬스터",14,"근접","MeleeAttack_Sword",null,"MeleeAttack_Sword"]
[13020,113020,"Normal_Melee",13020,13020,17,35,0,2.15,15,30,100,5,130,30,30,"Melee","MeleeAttack",11001,0,0,0,"악마 추종자1","언데드형 몬스터",22,"근접",null,13027,"타락한 기사3","언데드형 몬스터",26,"근접","MeleeAttack_Sword",null,"MeleeAttack_Sword"]
[13030,113030,"Normal_Range",13030,13030,9,18,0,3.05,26,38,100,3,120,30,30,"Range","vfx_Projectile_Orb04_Yellow",11001,0,0,0,"해골 법사","언데드형 몬스터",22,"원거리",null,13028,"해골 궁수","언데드형 몬스터",16,"원거리",null,null,"Projectile 4 yellow arrow"]
[13033,113033,"Normal_Melee",13033,13033,17,35,0,2.1,19,25,100,5,130,30,30,"Melee","MeleeAttack",11001,0,0,0,"해골 기사3","언데드형 몬스터",22,"근접",null,13029,"해골 근위병","언데드형 몬스터",16,"근접","MeleeAttack_Scythe",null,"MeleeAttack_Scythe"]
[13034,113034,"Normal_Melee",13034,13034,17,35,0,2.0499999999999998,20,23,100,5,130,30,30,"Melee","MeleeAttack",11001,0,0,0,"해골 기사4","언데드형 몬스터",22,"근접",null,13030,"해골 법사","언데드형 몬스터",22,"원거리",null,null,"vfx_Projectile_Orb04_Yellow"]
[10023,110023,"Boss_Melee",10023,10023,85,170,128,3,26,82,100,15,200,34,34,"Melee","MeleeAttack",11001,0,0,0,"레드드래곤1","보스 몬스터",23,null,null,13031,"해골 기사1","언데드형 몬스터",16,"근접","MeleeAttack_Sword",null,"MeleeAttack_Sword"]
[11015,111015,"Normal_Melee",11015,11015,18,37,9,2.8,22,42,100,5,130,30,30,"Melee","MeleeAttack",11001,0,0,0,"미노타우르스 챔피언1","수인형 몬스터",23,"근접",null,13032,"해골 기사2","언데드형 몬스터",21,"근접","MeleeAttack_Sword",null,"MeleeAttack_Sword"]
[11016,111016,"Normal_Melee",11016,11016,18,37,9,2.2999999999999998,17,36,100,5,130,30,30,"Melee","MeleeAttack",11001,0,0,0,"미노타우르스 챔피언2","수인형 몬스터",23,"근접",null,13033,"해골 기사3","언데드형 몬스터",22,"근접","MeleeAttack_Sword",null,"MeleeAttack_Sword"]
[12016,112016,"Normal_Melee",12016,12016,18,37,0,2.4,22,33,100,10,130,30,30,"Melee","MeleeAttack",11001,0,0,0,"다크엘프 기사4","인간형 몬스터",23,"근접",null,13034,"해골 기사4","언데드형 몬스터",22,"근접","MeleeAttack_Sword",null,"MeleeAttack_Sword"]
[13006,113006,"Normal_Melee",13006,13006,18,37,0,2.1,23,25,100,5,130,30,30,"Melee","MeleeAttack",11001,0,0,0,"데스나이트2","언데드형 몬스터",23,"근접",null,14001,"펑거스","마법 생물",1,"근접","MeleeAttack_Blow",null,"MeleeAttack_Blow"]
[13018,113018,"Normal_Range",13018,13018,9,18,0,2.9,32,35,100,3,120,30,30,"Range","vfx_Projectile_Orb15_DarkOrange",11001,0,0,0,"악마 광신자3","언데드형 몬스터",23,"원거리",null,14002,"동굴 박쥐","마법 생물",1,"근접","MeleeAttack_Claw",null,"MeleeAttack_Claw"]
[14005,114005,"Normal_Melee",14005,14005,18,37,0,1.9,21,22,100,5,130,30,30,"Melee","MeleeAttack",11001,0,0,0,"무리안","마법 생물",23,"근접",null,14003,"만드레고라","마법 생물",2,"근접","Bite  -  Blue",null,"Bite  -  Blue"]
[10024,110024,"Boss_Range",10024,10024,82,165,132,1.67,32,36,100,10,150,39,39,"Range","Projectile 20 black",11001,0,0,0,"바포메트7","보스 몬스터",24,null,null,14004,"켄타우로스","마법 생물",27,"근접","YellowSwordBeamHit",null,"YellowSwordBeamHit","Bite  -  Red"]
[11020,111020,"Normal_Melee",11020,11020,19,38,0,3.35,40,53,100,5,130,30,30,"Melee","MeleeAttack",11001,0,0,0,"버그베어1","수인형 몬스터",24,"근접",null,14005,"무리안","마법 생물",23,"근접","MeleeAttack_Claw",null,"MeleeAttack_Claw"]
[12009,112009,"Normal_Melee",12009,12009,19,38,0,3.3,24,60,100,5,150,30,30,"Melee","MeleeAttack",11001,0,0,0,"광전사2","인간형 몬스터",24,"근접",null,14006,"타이가","마법 생물",27,"근접","Bite  -  Red",null,"Bite  -  Red"]
[12011,112011,"Normal_Melee",12011,12011,19,38,0,3.2,35,46,100,5,150,30,30,"Melee","MeleeAttack",11001,0,0,0,"광전사4","인간형 몬스터",24,"근접",null,14007,"구울1","마법 생물",18,"근접","MeleeAttack_Claw",null,"MeleeAttack_Claw"]
[12018,112018,"Normal_Range",12018,12018,9,19,47,2.75,20,48,100,3,120,30,30,"Range","vfx_Projectile_Orb06_Purple",11001,0,0,0,"다크엘프 마법사3","인간형 몬스터",24,"원거리",null,14008,"구울2","마법 생물",19,"근접","MeleeAttack_Claw",null,"MeleeAttack_Claw"]
[12034,112034,"Normal_Melee",12034,12034,19,38,0,2.9,36,37,100,5,130,30,30,"Melee","MeleeAttack",11001,0,0,0,"오크 워리어1","인간형 몬스터",24,"근접",null,14009,"구울3","마법 생물",19,"근접","MeleeAttack_Claw",null,"MeleeAttack_Claw"]
[12035,112035,"Normal_Range",12035,12035,9,19,0,2.4,35,47,100,3,120,30,30,"Range","Projectile 21 red arrow",11001,0,0,0,"활든 강도1","인간형 몬스터",24,"원거리",null,14010,"다이어울프1","마법 생물",19,"근접","Bite  -  Red",null,"Bite  -  Red"]
[10025,110025,"Boss_Melee",10025,10025,85,170,136,1.5,30,34,100,15,150,39,39,"Range","vfx_ToonProjectile_Fireball01Green",11001,0,0,0,"거미여왕1","보스 몬스터",25,null,null,14011,"다이어울프2","마법 생물",19,"근접","Bite  -  Red",null,"Bite  -  Red"]
[12014,112014,"Normal_Melee",12014,12014,20,40,0,2.2999999999999998,30,32,100,10,130,30,30,"Melee","MeleeAttack",11001,0,0,0,"다크엘프 기사2","인간형 몬스터",25,"근접",null,14012,"데스웜","마법 생물",6,"근접","Bite  -  White",null,"Bite  -  White"]
[12015,112015,"Normal_Melee",12015,12015,20,40,0,2.25,26,35,100,10,130,30,30,"Melee","MeleeAttack",11001,0,0,0,"다크엘프 기사3","인간형 몬스터",25,"근접",null,14013,"동굴쥐1","마법 생물",1,"근접","Bite  -  White",null,"Bite  -  White"]
[13009,113009,"Normal_Melee",13009,13009,20,40,0,2.35,28,34,100,5,130,30,30,"Melee","MeleeAttack",11001,0,0,0,"머미3","언데드형 몬스터",25,"근접",null,14014,"동굴쥐2","마법 생물",3,"근접","Bite  -  White",null,"Bite  -  White"]
[13010,113010,"Normal_Range",13010,13010,10,20,0,2.8,30,44,100,3,120,30,30,"Range","vfx_Projectile_Orb13_DarkPurple",11001,0,0,0,"바포메트1","언데드형 몬스터",25,"원거리",null,14015,"리자드맨","마법 생물",27,"근접","MeleeAttack_Sword",null,"MeleeAttack_Sword"]
[14016,114016,"Normal_Melee",14016,14016,20,40,0,2.15,28,29,100,5,130,30,30,"Melee","MeleeAttack",11001,0,0,0,"맹독사1","마법 생물",25,"근접",null,14016,"맹독사1","마법 생물",25,"근접","Bite  -  Blue",null,"Bite  -  Blue"]
[14020,114020,"Normal_Melee",14020,14020,20,40,0,2,19,34,100,5,130,35,35,"Melee","MeleeAttack",11001,0,0,0,"스프리트","마법 생물",25,"근접",null,14017,"맹독사2","마법 생물",2,"근접","Bite  -  Blue",null,"Bite  -  Blue"]
[10026,110026,"Boss_Melee",10026,10026,88,176,142,1.43,26,38,100,15,150,39,39,"Melee","MeleeAttack",11001,0,0,0,"데스나이트1","보스 몬스터",26,null,null,14018,"미믹","마법 생물",1,"근접","Bite  -  Yellow",null,"Bite  -  Yellow"]
[13012,113012,"Normal_Range",13012,13012,10,21,0,2.85,24,62,100,3,120,30,30,"Range","vfx_Projectile_Orb14_Yellow",11001,0,0,0,"바포메트4","언데드형 몬스터",26,"원거리",null,14019,"셀로브","마법 생물",27,"근접","MeleeAttack_Claw",null,"MeleeAttack_Claw"]
[13021,113021,"Normal_Melee",13021,13021,21,42,0,2.2000000000000002,26,42,100,5,130,30,30,"Melee","MeleeAttack",11001,0,0,0,"악마 추종자2","언데드형 몬스터",26,"근접",null,14020,"스프리트","마법 생물",25,"근접","YellowSwordBeamHit",null,"YellowSwordBeamHit"]
[13022,113022,"Normal_Melee",13022,13022,21,42,0,2.0499999999999998,29,33,100,20,150,30,30,"Melee","MeleeAttack",11001,0,0,0,"악마 추종자3","언데드형 몬스터",26,"근접",null,14021,"슬라임1","마법 생물",2,"근접","MeleeAttack_Blow",null,"MeleeAttack_Blow"]
[13027,113027,"Normal_Melee",13027,13027,21,42,0,2.15,26,39,100,5,130,30,30,"Melee","MeleeAttack",11001,0,0,0,"타락한 기사3","언데드형 몬스터",26,"근접",null,14022,"슬라임2","마법 생물",3,"근접","MeleeAttack_Blow",null,"MeleeAttack_Blow"]
[14026,114026,"Normal_Melee",14026,14026,21,42,0,2,28,33,100,5,130,30,30,"Melee","MeleeAttack",11001,0,0,0,"임프4","마법 생물",26,"근접",null,14023,"임프1","마법 생물",20,"근접","MeleeAttack_Blow",null,"MeleeAttack_Blow"]
[10027,110027,"Boss_Melee",10027,10027,91,182,146,2.6,22,98,100,15,200,39,39,"Range","vfx_ToonProjectile_Bomb02Red",11001,0,0,0,"레드드래곤4","보스 몬스터",27,null,null,14024,"임프2","마법 생물",2,"근접","MeleeAttack_Blow",null,"MeleeAttack_Blow"]
[14004,114004,"Normal_Melee",14004,14004,21,43,0,2.25,36,38,100,5,130,30,30,"Melee","MeleeAttack",11001,0,0,0,"켄타우로스","마법 생물",27,"근접",null,14025,"임프3","마법 생물",20,"근접","MeleeAttack_Blow",null,"MeleeAttack_Blow"]
[14006,114006,"Normal_Melee",14006,14006,21,43,0,1.85,29,31,100,15,150,30,30,"Melee","MeleeAttack",11001,0,0,0,"타이가","마법 생물",27,"근접",null,14026,"임프4","마법 생물",26,"근접","MeleeAttack_Blow",null,"MeleeAttack_Blow"]
[14015,114015,"Normal_Melee",14015,14015,21,43,0,2,31,34,100,5,130,30,30,"Melee","MeleeAttack",11001,0,0,0,"리자드맨","마법 생물",27,"근접",null,14027,"임프 마법사1","마법 생물",16,"원거리",null,null,"Projectile 3 black fire"]
[14019,114019,"Normal_Melee",14019,14019,21,43,0,1.8,23,36,100,5,130,30,30,"Melee","MeleeAttack",11001,0,0,0,"셀로브","마법 생물",27,"근접",null,14028,"임프 마법사2","마법 생물",29,"원거리",null,null,"Projectile 6 blue fire"]
[15002,115002,"Normal_Range",15002,15002,11,26,0,3.5,38,115,100,3,120,30,30,"Range","vfx_Projectile_Fireball03_Orange",11001,0,0,0,"레드드래곤1","거인 종족",27,"원거리",null,14029,"임프 마법사3","마법 생물",19,"원거리",null,null,"Projectile 16 fire"]
[15012,115012,"Normal_Melee",15012,15012,22,45,0,3.1,50,62,100,5,130,30,30,"Melee","MeleeAttack",11001,0,0,0,"오우거3","거인 종족",27,"근접",null,14030,"임프 마법사4","마법 생물",20,"원거리",null,null,"Projectile 4 fire"]
[10028,110028,"Boss_Range",10028,10028,92,184,182,1.75,43,46,100,15,180,40,40,"Melee","MeleeAttack",11001,0,0,0,"타락한 천사","보스 몬스터",28,null,null,14031,"임프 전사2","마법 생물",20,"근접","MeleeAttack_Sword",null,"MeleeAttack_Sword"]
[14028,114028,"Normal_Range",14028,14028,11,22,0,2.75,48,52,100,3,120,30,30,"Range","Projectile 6 blue fire",11001,0,0,0,"임프 마법사2","마법 생물",29,"원거리",null,14032,"임프 전사3","마법 생물",19,"근접","MeleeAttack_Sword",null,"MeleeAttack_Sword"]
[14033,114033,"Normal_Melee",14033,14033,22,45,0,2,23,50,100,15,130,30,30,"Melee","MeleeAttack",11001,0,0,0,"하피","마법 생물",29,"근접",null,14033,"하피","마법 생물",29,"근접","MeleeAttack_Claw",null,"MeleeAttack_Claw"]
[15001,115001,"Normal_Melee",15001,15001,23,46,0,3,34,104,100,15,130,30,30,"Melee","MeleeAttack",11001,0,0,0,"싸이 전사","거인 종족",29,"근접",null,14034,"흡혈귀1","마법 생물",20,"근접","MeleeAttack_Claw",null,"MeleeAttack_Claw"]
[15005,115005,"Normal_Melee",15005,15005,23,46,0,3.3,72,81,100,5,130,30,30,"Melee","MeleeAttack",11001,0,0,0,"약탈꾼2","거인 종족",29,"근접",null,15001,"싸이 전사","거인 종족",29,"근접","MeleeAttack_Axe",null,"MeleeAttack_Axe"]
[15010,115010,"Normal_Melee",15010,15010,23,55,0,3.25,38,114,100,5,130,30,30,"Melee","MeleeAttack",11001,0,0,0,"예티6","거인 종족",29,"근접",null,15002,"레드드래곤1","거인 종족",27,"원거리",null,null,"vfx_Projectile_Fireball03_Orange"]
[15015,115015,"Normal_Melee",15015,15015,23,46,0,2.9,21,114,100,5,150,30,30,"Melee","MeleeAttack",11001,0,0,0,"트롤 워리어2","거인 종족",29,"근접",null,15003,"레드드래곤2","거인 종족",32,"원거리",null,null,"vfx_Projectile_Fireball03_Green"]
[13016,113016,"Normal_Range",13016,13016,12,24,0,2.8,54,64,100,3,120,30,30,"Range","vfx_Projectile_Orb15_DarkBlue",11001,0,0,0,"악마 광신자1","언데드형 몬스터",30,"원거리",null,15004,"약탈꾼1","거인 종족",31,"근접","MeleeAttack_Blunt",null,"MeleeAttack_Blunt"]
[15013,115013,"Normal_Melee",15013,15013,24,58,0,3.45,28,118,100,5,130,30,30,"Melee","MeleeAttack",11001,0,0,0,"용암골렘1","거인 종족",30,"근접",null,15005,"약탈꾼2","거인 종족",29,"근접","MeleeAttack_Blunt",null,"MeleeAttack_Blunt"]
[15014,115014,"Normal_Melee",15014,15014,24,58,0,2.95,46,80,100,5,150,30,30,"Melee","MeleeAttack",11001,0,0,0,"트롤 워리어1","거인 종족",30,"근접",null,15006,"예티1","거인 종족",31,"근접","MeleeAttack_Blunt",null,"MeleeAttack_Blunt"]
[15016,115016,"Normal_Melee",15016,15016,24,48,0,2.95,58,68,100,5,150,30,30,"Melee","MeleeAttack",11001,0,0,0,"트롤 워리어3","거인 종족",30,"근접",null,15007,"예티2","거인 종족",32,"근접","MeleeAttack_Blunt",null,"MeleeAttack_Blunt"]
[15017,115017,"Normal_Melee",15017,15017,24,58,0,3,33,95,100,5,150,30,30,"Melee","MeleeAttack",11001,0,0,0,"트롤 워리어5","거인 종족",30,"근접",null,15008,"예티3","거인 종족",31,"근접","MeleeAttack_Blunt",null,"MeleeAttack_Blunt"]
[13013,113013,"Normal_Range",13013,13013,12,25,0,2.95,62,74,100,3,120,30,30,"Range","vfx_Projectile_Orb14_Red",11001,0,0,0,"바포메트5","언데드형 몬스터",31,"원거리",null,15009,"예티5","거인 종족",31,"근접","MeleeAttack_Blunt",null,"MeleeAttack_Blunt"]
[15004,115004,"Normal_Melee",15004,15004,25,50,0,3.2,84,91,100,5,130,30,30,"Melee","MeleeAttack",11001,0,0,0,"약탈꾼1","거인 종족",31,"근접",null,15010,"예티6","거인 종족",29,"근접","MeleeAttack_Blunt",null,"MeleeAttack_Blunt"]
[15006,115006,"Normal_Melee",15006,15006,25,50,0,3.5,37,156,100,5,130,30,30,"Melee","MeleeAttack",11001,0,0,0,"예티1","거인 종족",31,"근접",null,15011,"오우거2","거인 종족",31,"근접","MeleeAttack_Blunt",null,"MeleeAttack_Blunt"]
[15008,115008,"Normal_Melee",15008,15008,25,50,0,3.7,21,184,100,5,130,30,30,"Melee","MeleeAttack",11001,0,0,0,"예티3","거인 종족",31,"근접",null,15012,"오우거3","거인 종족",27,"근접","MeleeAttack_Blunt",null,"MeleeAttack_Blunt"]
[15009,115009,"Normal_Melee",15009,15009,25,60,0,3.2,68,110,100,5,130,30,30,"Melee","MeleeAttack",11001,0,0,0,"예티5","거인 종족",31,"근접",null,15013,"용암골렘1","거인 종족",30,"근접","YellowSwordBeamHit",null,"YellowSwordBeamHit"]
[15011,115011,"Normal_Melee",15011,15011,25,50,0,3,66,74,100,5,130,30,30,"Melee","MeleeAttack",11001,0,0,0,"오우거2","거인 종족",31,"근접",null,15014,"트롤 워리어1","거인 종족",30,"근접","MeleeAttack_Blunt",null,"MeleeAttack_Blunt"]
[13011,113011,"Normal_Range",13011,13011,13,26,0,2.9,70,78,100,3,120,30,30,"Range","vfx_Projectile_Orb13_DarkRed",11001,0,0,0,"바포메트3","언데드형 몬스터",32,"원거리",null,15015,"트롤 워리어2","거인 종족",29,"근접","MeleeAttack_Blunt",null,"MeleeAttack_Blunt"]
[15003,115003,"Normal_Range",15003,15003,13,31,0,3.25,62,105,100,3,120,30,30,"Range","vfx_Projectile_Fireball03_Green",11001,0,0,0,"레드드래곤2","거인 종족",32,"원거리",null,15016,"트롤 워리어3","거인 종족",30,"근접","MeleeAttack_Blunt",null,"MeleeAttack_Blunt"]
[15007,115007,"Normal_Melee",15007,15007,25,51,0,3.65,98,124,100,5,130,30,30,"Melee","MeleeAttack",11001,0,0,0,"예티2","거인 종족",32,"근접",null,15017,"트롤 워리어5","거인 종족",30,"근접","MeleeAttack_Blunt",null,"MeleeAttack_Blunt"]
[15018,115018,"Normal_Melee",15018,15018,25,62,0,3.1,33,156,100,5,130,30,30,"Melee","MeleeAttack",11001,0,0,0,"트롤 워리어6","거인 종족",32,"근접",null,15018,"트롤 워리어6","거인 종족",32,"근접","MeleeAttack_Blunt",null,"MeleeAttack_Blunt"]
[15019,115019,"Normal_Melee",15019,15019,25,62,0,3.15,72,120,100,5,130,30,30,"Melee","MeleeAttack",11001,0,0,0,"트롤 워리어7","거인 종족",32,"근접",null,15019,"트롤 워리어7","거인 종족",32,"근접","MeleeAttack_Blunt",null,"MeleeAttack_Blunt"]

{"sheet":"스테이지 컨셉","index":33,"n_rows":156,"n_cols":17,"rows_kept":156,"cut":false,"hidden":false,"merged":[[1,1,4,1],[1,8,19,8],[6,1,11,1],[13,1,17,1],[19,1,25,1],[20,8,38,8],[27,1,32,1],[34,1,40,1],[39,8,56,8],[42,1,45,1],[47,1,51,1],[53,1,58,1],[57,8,75,8],[60,1,64,1],[66,1,70,1],[72,1,78,1],[76,8,95,8],[80,1,83,1],[85,1,89,1],[91,1,95,1],[96,8,116,8],[97,1,99,1],[101,1,108,1],[110,1,117,1],[117,8,135,8],[119,1,127,1],[129,1,137,1],[136,8,155,8],[139,1,142,1]]}
["맵 테마","던전","등장 몬스터","몬스터 ID",null,"보스","보스 ID"]
["스테이지 1-1","① 수상한 던전","펑거스, 동굴 박쥐, 동굴쥐1",{"$f":"_xlfn.TEXTJOIN(\", \", TRUE,\n    _xlfn.MAP(TRIM(_xlfn.TEXTSPLIT(C2, \",\")),\n        _xlfn.LAMBDA(_xlpm.n,\n            _xlfn.LET(\n                _xlpm.result, _xlfn.XLOOKUP(_xlpm.n, J:J, K:K, \"\"),\n                IF(_xlpm.result = \"\", _xlpm.n, _xlpm.result)\n            )\n        )\n    )\n)","v":"14001, 14002, 14013"},{"$f":"_xlfn.TEXTJOIN(\" | \", TRUE,\n  _xlfn.MAP(TRIM(_xlfn.TEXTSPLIT(D2, \",\")),\n    _xlfn.LAMBDA(_xlpm.id,\n      _xlpm.id & \": \" &\n      SUMPRODUCT(\n        (LEN(\",\" & SUBSTITUTE($D$2:$D$500,\" \",\"\") & \",\")\n         - LEN(SUBSTITUTE(\",\" & SUBSTITUTE($D$2:$D$500,\" \",\"\") & \",\", \",\" & _xlpm.id & \",\", \"\")))\n        / LEN(\",\" & _xlpm.id & \",\")\n      )\n    )\n  )\n)","v":"14001: 3 | 14002: 3 | 14013: 3"},null,null,null,1,"놀1",11001,"Melee"]
["스테이지 1-2",null,"펑거스, 동굴쥐1, 동굴쥐2, 놀아처2",{"$f":"_xlfn.TEXTJOIN(\", \", TRUE,\n    _xlfn.MAP(TRIM(_xlfn.TEXTSPLIT(C3, \",\")),\n        _xlfn.LAMBDA(_xlpm.n,\n            _xlfn.LET(\n                _xlpm.result, _xlfn.XLOOKUP(_xlpm.n, J:J, K:K, \"\"),\n                IF(_xlpm.result = \"\", _xlpm.n, _xlpm.result)\n            )\n        )\n    )\n)","v":"14001, 14013, 14014, 11007"},{"$f":"_xlfn.TEXTJOIN(\" | \", TRUE,\n  _xlfn.MAP(TRIM(_xlfn.TEXTSPLIT(D3, \",\")),\n    _xlfn.LAMBDA(_xlpm.id,\n      _xlpm.id & \": \" &\n      SUMPRODUCT(\n        (LEN(\",\" & SUBSTITUTE($D$2:$D$500,\" \",\"\") & \",\")\n         - LEN(SUBSTITUTE(\",\" & SUBSTITUTE($D$2:$D$500,\" \",\"\") & \",\", \",\" & _xlpm.id & \",\", \"\")))\n        / LEN(\",\" & _xlpm.id & \",\")\n      )\n    )\n  )\n)","v":"14001: 3 | 14013: 3 | 14014: 3 | 11007: 3"},"놀 아처1",10001,null,null,"놀2",11002,"Melee"]
["스테이지 1-3",null,"동굴쥐2, 놀1, 놀2, 놀아처2",{"$f":"_xlfn.TEXTJOIN(\", \", TRUE,\n    _xlfn.MAP(TRIM(_xlfn.TEXTSPLIT(C4, \",\")),\n        _xlfn.LAMBDA(_xlpm.n,\n            _xlfn.LET(\n                _xlpm.result, _xlfn.XLOOKUP(_xlpm.n, J:J, K:K, \"\"),\n                IF(_xlpm.result = \"\", _xlpm.n, _xlpm.result)\n            )\n        )\n    )\n)","v":"14014, 11001, 11002, 11007"},{"$f":"_xlfn.TEXTJOIN(\" | \", TRUE,\n  _xlfn.MAP(TRIM(_xlfn.TEXTSPLIT(D4, \",\")),\n    _xlfn.LAMBDA(_xlpm.id,\n      _xlpm.id & \": \" &\n      SUMPRODUCT(\n        (LEN(\",\" & SUBSTITUTE($D$2:$D$500,\" \",\"\") & \",\")\n         - LEN(SUBSTITUTE(\",\" & SUBSTITUTE($D$2:$D$500,\" \",\"\") & \",\", \",\" & _xlpm.id & \",\", \"\")))\n        / LEN(\",\" & _xlpm.id & \",\")\n      )\n    )\n  )\n)","v":"14014: 3 | 11001: 3 | 11002: 3 | 11007: 3"},null,null,null,null,"놀아처2",11007,"Range"]
["스테이지 1-4",null,"놀1, 놀2, 놀아처2, 만드레고라, 놀3",{"$f":"_xlfn.TEXTJOIN(\", \", TRUE,\n    _xlfn.MAP(TRIM(_xlfn.TEXTSPLIT(C5, \",\")),\n        _xlfn.LAMBDA(_xlpm.n,\n            _xlfn.LET(\n                _xlpm.result, _xlfn.XLOOKUP(_xlpm.n, J:J, K:K, \"\"),\n                IF(_xlpm.result = \"\", _xlpm.n, _xlpm.result)\n            )\n        )\n    )\n)","v":"11001, 11002, 11007, 14003, 11003"},{"$f":"_xlfn.TEXTJOIN(\" | \", TRUE,\n  _xlfn.MAP(TRIM(_xlfn.TEXTSPLIT(D5, \",\")),\n    _xlfn.LAMBDA(_xlpm.id,\n      _xlpm.id & \": \" &\n      SUMPRODUCT(\n        (LEN(\",\" & SUBSTITUTE($D$2:$D$500,\" \",\"\") & \",\")\n         - LEN(SUBSTITUTE(\",\" & SUBSTITUTE($D$2:$D$500,\" \",\"\") & \",\", \",\" & _xlpm.id & \",\", \"\")))\n        / LEN(\",\" & _xlpm.id & \",\")\n      )\n    )\n  )\n)","v":"11001: 3 | 11002: 3 | 11007: 3 | 14003: 3 | 11003: 2"},"놀 강도2",10002,null,null,"펑거스",14001,"Melee"]
[null,null,null,null,null,null,null,null,null,"동굴 박쥐",14002,"Melee"]
["스테이지 2-1","① 트롤의 동굴","놀1, 놀2, 놀3, 놀강도3, 놀아처3",{"$f":"_xlfn.TEXTJOIN(\", \", TRUE,\n    _xlfn.MAP(TRIM(_xlfn.TEXTSPLIT(C7, \",\")),\n        _xlfn.LAMBDA(_xlpm.n,\n            _xlfn.LET(\n                _xlpm.result, _xlfn.XLOOKUP(_xlpm.n, J:J, K:K, \"\"),\n                IF(_xlpm.result = \"\", _xlpm.n, _xlpm.result)\n            )\n        )\n    )\n)","v":"11001, 11002, 11003, 11005, 11008"},{"$f":"_xlfn.TEXTJOIN(\" | \", TRUE,\n  _xlfn.MAP(TRIM(_xlfn.TEXTSPLIT(D7, \",\")),\n    _xlfn.LAMBDA(_xlpm.id,\n      _xlpm.id & \": \" &\n      SUMPRODUCT(\n        (LEN(\",\" & SUBSTITUTE($D$2:$D$500,\" \",\"\") & \",\")\n         - LEN(SUBSTITUTE(\",\" & SUBSTITUTE($D$2:$D$500,\" \",\"\") & \",\", \",\" & _xlpm.id & \",\", \"\")))\n        / LEN(\",\" & _xlpm.id & \",\")\n      )\n    )\n  )\n)","v":"11001: 3 | 11002: 3 | 11003: 2 | 11005: 2 | 11008: 3"},"놀 강도2",10002,null,null,"동굴쥐1",14013,"Melee"]
["스테이지 2-2",null,"만드레고라, 임프2, 동굴쥐1, 동굴쥐2",{"$f":"_xlfn.TEXTJOIN(\", \", TRUE,\n    _xlfn.MAP(TRIM(_xlfn.TEXTSPLIT(C8, \",\")),\n        _xlfn.LAMBDA(_xlpm.n,\n            _xlfn.LET(\n                _xlpm.result, _xlfn.XLOOKUP(_xlpm.n, J:J, K:K, \"\"),\n                IF(_xlpm.result = \"\", _xlpm.n, _xlpm.result)\n            )\n        )\n    )\n)","v":"14003, 14024, 14013, 14014"},{"$f":"_xlfn.TEXTJOIN(\" | \", TRUE,\n  _xlfn.MAP(TRIM(_xlfn.TEXTSPLIT(D8, \",\")),\n    _xlfn.LAMBDA(_xlpm.id,\n      _xlpm.id & \": \" &\n      SUMPRODUCT(\n        (LEN(\",\" & SUBSTITUTE($D$2:$D$500,\" \",\"\") & \",\")\n         - LEN(SUBSTITUTE(\",\" & SUBSTITUTE($D$2:$D$500,\" \",\"\") & \",\", \",\" & _xlpm.id & \",\", \"\")))\n        / LEN(\",\" & _xlpm.id & \",\")\n      )\n    )\n  )\n)","v":"14003: 3 | 14024: 3 | 14013: 3 | 14014: 3"},"임프 전사1",10003,null,null,"미믹",14018,"Melee"]
["스테이지 2-3",null,"슬라임1, 슬라임2, 맹독사2, 동굴 박쥐, 만드레고라",{"$f":"_xlfn.TEXTJOIN(\", \", TRUE,\n    _xlfn.MAP(TRIM(_xlfn.TEXTSPLIT(C9, \",\")),\n        _xlfn.LAMBDA(_xlpm.n,\n            _xlfn.LET(\n                _xlpm.result, _xlfn.XLOOKUP(_xlpm.n, J:J, K:K, \"\"),\n                IF(_xlpm.result = \"\", _xlpm.n, _xlpm.result)\n            )\n        )\n    )\n)","v":"14021, 14022, 14017, 14002, 14003"},{"$f":"_xlfn.TEXTJOIN(\" | \", TRUE,\n  _xlfn.MAP(TRIM(_xlfn.TEXTSPLIT(D9, \",\")),\n    _xlfn.LAMBDA(_xlpm.id,\n      _xlpm.id & \": \" &\n      SUMPRODUCT(\n        (LEN(\",\" & SUBSTITUTE($D$2:$D$500,\" \",\"\") & \",\")\n         - LEN(SUBSTITUTE(\",\" & SUBSTITUTE($D$2:$D$500,\" \",\"\") & \",\", \",\" & _xlpm.id & \",\", \"\")))\n        / LEN(\",\" & _xlpm.id & \",\")\n      )\n    )\n  )\n)","v":"14021: 2 | 14022: 2 | 14017: 2 | 14002: 3 | 14003: 3"},null,null,null,null,"놀3",11003,"Melee"]
["스테이지 2-4",null,"트롤2, 트롤3, 놀강도3, 놀아처3, 임프2",{"$f":"_xlfn.TEXTJOIN(\", \", TRUE,\n    _xlfn.MAP(TRIM(_xlfn.TEXTSPLIT(C10, \",\")),\n        _xlfn.LAMBDA(_xlpm.n,\n            _xlfn.LET(\n                _xlpm.result, _xlfn.XLOOKUP(_xlpm.n, J:J, K:K, \"\"),\n                IF(_xlpm.result = \"\", _xlpm.n, _xlpm.result)\n            )\n        )\n    )\n)","v":"11030, 11031, 11005, 11008, 14024"},{"$f":"_xlfn.TEXTJOIN(\" | \", TRUE,\n  _xlfn.MAP(TRIM(_xlfn.TEXTSPLIT(D10, \",\")),\n    _xlfn.LAMBDA(_xlpm.id,\n      _xlpm.id & \": \" &\n      SUMPRODUCT(\n        (LEN(\",\" & SUBSTITUTE($D$2:$D$500,\" \",\"\") & \",\")\n         - LEN(SUBSTITUTE(\",\" & SUBSTITUTE($D$2:$D$500,\" \",\"\") & \",\", \",\" & _xlpm.id & \",\", \"\")))\n        / LEN(\",\" & _xlpm.id & \",\")\n      )\n    )\n  )\n)","v":"11030: 2 | 11031: 2 | 11005: 2 | 11008: 3 | 14024: 3"},"임프 전사1",10003,null,null,"놀강도3",11005,"Melee"]
["스테이지 2-5",null,"미노타우로스 도살자1, 임프2, 슬라임1, 동굴 박쥐, 맹독사2, 펑거스",{"$f":"_xlfn.TEXTJOIN(\", \", TRUE,\n    _xlfn.MAP(TRIM(_xlfn.TEXTSPLIT(C11, \",\")),\n        _xlfn.LAMBDA(_xlpm.n,\n            _xlfn.LET(\n                _xlpm.result, _xlfn.XLOOKUP(_xlpm.n, J:J, K:K, \"\"),\n                IF(_xlpm.result = \"\", _xlpm.n, _xlpm.result)\n            )\n        )\n    )\n)","v":"11013, 14024, 14021, 14002, 14017, 14001"},{"$f":"_xlfn.TEXTJOIN(\" | \", TRUE,\n  _xlfn.MAP(TRIM(_xlfn.TEXTSPLIT(D11, \",\")),\n    _xlfn.LAMBDA(_xlpm.id,\n      _xlpm.id & \": \" &\n      SUMPRODUCT(\n        (LEN(\",\" & SUBSTITUTE($D$2:$D$500,\" \",\"\") & \",\")\n         - LEN(SUBSTITUTE(\",\" & SUBSTITUTE($D$2:$D$500,\" \",\"\") & \",\", \",\" & _xlpm.id & \",\", \"\")))\n        / LEN(\",\" & _xlpm.id & \",\")\n      )\n    )\n  )\n)","v":"11013: 2 | 14024: 3 | 14021: 2 | 14002: 3 | 14017: 2 | 14001: 3"},"오우거1",10004,null,null,"만드레고라",14003,"Range"]
["스테이지 2-6",null,"슬라임2, 미노타우로스 도살자1, 트롤2, 트롤3, 놀아처3",{"$f":"_xlfn.TEXTJOIN(\", \", TRUE,\n    _xlfn.MAP(TRIM(_xlfn.TEXTSPLIT(C12, \",\")),\n        _xlfn.LAMBDA(_xlpm.n,\n            _xlfn.LET(\n                _xlpm.result, _xlfn.XLOOKUP(_xlpm.n, J:J, K:K, \"\"),\n                IF(_xlpm.result = \"\", _xlpm.n, _xlpm.result)\n            )\n        )\n    )\n)","v":"14022, 11013, 11030, 11031, 11008"},{"$f":"_xlfn.TEXTJOIN(\" | \", TRUE,\n  _xlfn.MAP(TRIM(_xlfn.TEXTSPLIT(D12, \",\")),\n    _xlfn.LAMBDA(_xlpm.id,\n      _xlpm.id & \": \" &\n      SUMPRODUCT(\n        (LEN(\",\" & SUBSTITUTE($D$2:$D$500,\" \",\"\") & \",\")\n         - LEN(SUBSTITUTE(\",\" & SUBSTITUTE($D$2:$D$500,\" \",\"\") & \",\", \",\" & _xlpm.id & \",\", \"\")))\n        / LEN(\",\" & _xlpm.id & \",\")\n      )\n    )\n  )\n)","v":"14022: 2 | 11013: 2 | 11030: 2 | 11031: 2 | 11008: 3"},"오우거1",10004,null,null,"맹독사2",14017,"Melee"]
[null,null,null,null,null,null,null,null,null,"슬라임1",14021,"Range"]
["스테이지 3-1","② 오크 소굴","놀강도4, 오크1, 오크 궁수1, 데스웜",{"$f":"_xlfn.TEXTJOIN(\", \", TRUE,\n    _xlfn.MAP(TRIM(_xlfn.TEXTSPLIT(C14, \",\")),\n        _xlfn.LAMBDA(_xlpm.n,\n            _xlfn.LET(\n                _xlpm.result, _xlfn.XLOOKUP(_xlpm.n, J:J, K:K, \"\"),\n                IF(_xlpm.result = \"\", _xlpm.n, _xlpm.result)\n            )\n        )\n    )\n)","v":"11006, 12032, 12028, 14012"},{"$f":"_xlfn.TEXTJOIN(\" | \", TRUE,\n  _xlfn.MAP(TRIM(_xlfn.TEXTSPLIT(D14, \",\")),\n    _xlfn.LAMBDA(_xlpm.id,\n      _xlpm.id & \": \" &\n      SUMPRODUCT(\n        (LEN(\",\" & SUBSTITUTE($D$2:$D$500,\" \",\"\") & \",\")\n         - LEN(SUBSTITUTE(\",\" & SUBSTITUTE($D$2:$D$500,\" \",\"\") & \",\", \",\" & _xlpm.id & \",\", \"\")))\n        / LEN(\",\" & _xlpm.id & \",\")\n      )\n    )\n  )\n)","v":"11006: 3 | 12032: 3 | 12028: 4 | 14012: 3"},"바포메트6",10005,null,null,"임프2",14024,"Melee"]
["스테이지 3-2",null,"오크1, 오크2, 오크 궁수2, 놀강도4",{"$f":"_xlfn.TEXTJOIN(\", \", TRUE,\n    _xlfn.MAP(TRIM(_xlfn.TEXTSPLIT(C15, \",\")),\n        _xlfn.LAMBDA(_xlpm.n,\n            _xlfn.LET(\n                _xlpm.result, _xlfn.XLOOKUP(_xlpm.n, J:J, K:K, \"\"),\n                IF(_xlpm.result = \"\", _xlpm.n, _xlpm.result)\n            )\n        )\n    )\n)","v":"12032, 12033, 12029, 11006"},{"$f":"_xlfn.TEXTJOIN(\" | \", TRUE,\n  _xlfn.MAP(TRIM(_xlfn.TEXTSPLIT(D15, \",\")),\n    _xlfn.LAMBDA(_xlpm.id,\n      _xlpm.id & \": \" &\n      SUMPRODUCT(\n        (LEN(\",\" & SUBSTITUTE($D$2:$D$500,\" \",\"\") & \",\")\n         - LEN(SUBSTITUTE(\",\" & SUBSTITUTE($D$2:$D$500,\" \",\"\") & \",\", \",\" & _xlpm.id & \",\", \"\")))\n        / LEN(\",\" & _xlpm.id & \",\")\n      )\n    )\n  )\n)","v":"12032: 3 | 12033: 3 | 12029: 4 | 11006: 3"},null,null,null,null,"놀아처3",11008,"Range"]
["스테이지 3-3",null,"오크1, 오크2, 오크 마법사1, 오크 마법사2, 활든 강도2",{"$f":"_xlfn.TEXTJOIN(\", \", TRUE,\n    _xlfn.MAP(TRIM(_xlfn.TEXTSPLIT(C16, \",\")),\n        _xlfn.LAMBDA(_xlpm.n,\n            _xlfn.LET(\n                _xlpm.result, _xlfn.XLOOKUP(_xlpm.n, J:J, K:K, \"\"),\n                IF(_xlpm.result = \"\", _xlpm.n, _xlpm.result)\n            )\n        )\n    )\n)","v":"12032, 12033, 12030, 12031, 12036"},{"$f":"_xlfn.TEXTJOIN(\" | \", TRUE,\n  _xlfn.MAP(TRIM(_xlfn.TEXTSPLIT(D16, \",\")),\n    _xlfn.LAMBDA(_xlpm.id,\n      _xlpm.id & \": \" &\n      SUMPRODUCT(\n        (LEN(\",\" & SUBSTITUTE($D$2:$D$500,\" \",\"\") & \",\")\n         - LEN(SUBSTITUTE(\",\" & SUBSTITUTE($D$2:$D$500,\" \",\"\") & \",\", \",\" & _xlpm.id & \",\", \"\")))\n        / LEN(\",\" & _xlpm.id & \",\")\n      )\n    )\n  )\n)","v":"12032: 3 | 12033: 3 | 12030: 4 | 12031: 4 | 12036: 6"},"바포메트6",10005,null,null,"미노타우로스 도살자1",11013,"Melee"]
["스테이지 3-4",null,"오크2, 오크 궁수1, 오크 궁수2, 놀강도4, 사악한 악령1",{"$f":"_xlfn.TEXTJOIN(\", \", TRUE,\n    _xlfn.MAP(TRIM(_xlfn.TEXTSPLIT(C17, \",\")),\n        _xlfn.LAMBDA(_xlpm.n,\n            _xlfn.LET(\n                _xlpm.result, _xlfn.XLOOKUP(_xlpm.n, J:J, K:K, \"\"),\n                IF(_xlpm.result = \"\", _xlpm.n, _xlpm.result)\n            )\n        )\n    )\n)","v":"12033, 12028, 12029, 11006, 13014"},{"$f":"_xlfn.TEXTJOIN(\" | \", TRUE,\n  _xlfn.MAP(TRIM(_xlfn.TEXTSPLIT(D17, \",\")),\n    _xlfn.LAMBDA(_xlpm.id,\n      _xlpm.id & \": \" &\n      SUMPRODUCT(\n        (LEN(\",\" & SUBSTITUTE($D$2:$D$500,\" \",\"\") & \",\")\n         - LEN(SUBSTITUTE(\",\" & SUBSTITUTE($D$2:$D$500,\" \",\"\") & \",\", \",\" & _xlpm.id & \",\", \"\")))\n        / LEN(\",\" & _xlpm.id & \",\")\n      )\n    )\n  )\n)","v":"12033: 3 | 12028: 4 | 12029: 4 | 11006: 3 | 13014: 3"},null,null,null,null,"트롤2",11030,"Melee"]
["스테이지 3-5",null,"활든 강도2, 사악한 악령1, 데스웜, 미노타우르스 광전사1, 미노타우로스 도살자2",{"$f":"_xlfn.TEXTJOIN(\", \", TRUE,\n    _xlfn.MAP(TRIM(_xlfn.TEXTSPLIT(C18, \",\")),\n        _xlfn.LAMBDA(_xlpm.n,\n            _xlfn.LET(\n                _xlpm.result, _xlfn.XLOOKUP(_xlpm.n, J:J, K:K, \"\"),\n                IF(_xlpm.result = \"\", _xlpm.n, _xlpm.result)\n            )\n        )\n    )\n)","v":"12036, 13014, 14012, 11009, 11014"},{"$f":"_xlfn.TEXTJOIN(\" | \", TRUE,\n  _xlfn.MAP(TRIM(_xlfn.TEXTSPLIT(D18, \",\")),\n    _xlfn.LAMBDA(_xlpm.id,\n      _xlpm.id & \": \" &\n      SUMPRODUCT(\n        (LEN(\",\" & SUBSTITUTE($D$2:$D$500,\" \",\"\") & \",\")\n         - LEN(SUBSTITUTE(\",\" & SUBSTITUTE($D$2:$D$500,\" \",\"\") & \",\", \",\" & _xlpm.id & \",\", \"\")))\n        / LEN(\",\" & _xlpm.id & \",\")\n      )\n    )\n  )\n)","v":"12036: 6 | 13014: 3 | 14012: 3 | 11009: 3 | 11014: 3"},"거미여왕2",10006,null,null,"트롤3",11031,"Melee"]
[null,null,null,null,null,null,null,null,null,"동굴쥐2",14014,"Melee"]
["스테이지 4-1","② 버려진 미궁","미노타우르스 광전사1, 오크 궁수2, 오크 마법사1, 오크 마법사2, 트롤1",{"$f":"_xlfn.TEXTJOIN(\", \", TRUE,\n    _xlfn.MAP(TRIM(_xlfn.TEXTSPLIT(C20, \",\")),\n        _xlfn.LAMBDA(_xlpm.n,\n            _xlfn.LET(\n                _xlpm.result, _xlfn.XLOOKUP(_xlpm.n, J:J, K:K, \"\"),\n                IF(_xlpm.result = \"\", _xlpm.n, _xlpm.result)\n            )\n        )\n    )\n)","v":"11009, 12029, 12030, 12031, 11029"},{"$f":"_xlfn.TEXTJOIN(\" | \", TRUE,\n  _xlfn.MAP(TRIM(_xlfn.TEXTSPLIT(D20, \",\")),\n    _xlfn.LAMBDA(_xlpm.id,\n      _xlpm.id & \": \" &\n      SUMPRODUCT(\n        (LEN(\",\" & SUBSTITUTE($D$2:$D$500,\" \",\"\") & \",\")\n         - LEN(SUBSTITUTE(\",\" & SUBSTITUTE($D$2:$D$500,\" \",\"\") & \",\", \",\" & _xlpm.id & \",\", \"\")))\n        / LEN(\",\" & _xlpm.id & \",\")\n      )\n    )\n  )\n)","v":"11009: 3 | 12029: 4 | 12030: 4 | 12031: 4 | 11029: 4"},"거미여왕2",10006,null,null,"슬라임2",14022,"Range"]
["스테이지 4-2",null,"활든 강도2, 데스웜, 사악한 악령1,미노타우로스 도살자2, 싸이클롭스1",{"$f":"_xlfn.TEXTJOIN(\", \", TRUE,\n    _xlfn.MAP(TRIM(_xlfn.TEXTSPLIT(C21, \",\")),\n        _xlfn.LAMBDA(_xlpm.n,\n            _xlfn.LET(\n                _xlpm.result, _xlfn.XLOOKUP(_xlpm.n, J:J, K:K, \"\"),\n                IF(_xlpm.result = \"\", _xlpm.n, _xlpm.result)\n            )\n        )\n    )\n)","v":"12036, 14012, 13014, 11014, 11024"},{"$f":"_xlfn.TEXTJOIN(\" | \", TRUE,\n  _xlfn.MAP(TRIM(_xlfn.TEXTSPLIT(D21, \",\")),\n    _xlfn.LAMBDA(_xlpm.id,\n      _xlpm.id & \": \" &\n      SUMPRODUCT(\n        (LEN(\",\" & SUBSTITUTE($D$2:$D$500,\" \",\"\") & \",\")\n         - LEN(SUBSTITUTE(\",\" & SUBSTITUTE($D$2:$D$500,\" \",\"\") & \",\", \",\" & _xlpm.id & \",\", \"\")))\n        / LEN(\",\" & _xlpm.id & \",\")\n      )\n    )\n  )\n)","v":"12036: 6 | 14012: 3 | 13014: 3 | 11014: 3 | 11024: 4"},"흑기사2",10007,null,2,"미노타우르스 광전사1",11009,"Melee"]
["스테이지 4-3",null,"트롤1, 미노타우르스 챔피언4, 미노타우르스 광전사1, 오크 마법사1, 싸이클롭스1",{"$f":"_xlfn.TEXTJOIN(\", \", TRUE,\n    _xlfn.MAP(TRIM(_xlfn.TEXTSPLIT(C22, \",\")),\n        _xlfn.LAMBDA(_xlpm.n,\n            _xlfn.LET(\n                _xlpm.result, _xlfn.XLOOKUP(_xlpm.n, J:J, K:K, \"\"),\n                IF(_xlpm.result = \"\", _xlpm.n, _xlpm.result)\n            )\n        )\n    )\n)","v":"11029, 11018, 11009, 12030, 11024"},{"$f":"_xlfn.TEXTJOIN(\" | \", TRUE,\n  _xlfn.MAP(TRIM(_xlfn.TEXTSPLIT(D22, \",\")),\n    _xlfn.LAMBDA(_xlpm.id,\n      _xlpm.id & \": \" &\n      SUMPRODUCT(\n        (LEN(\",\" & SUBSTITUTE($D$2:$D$500,\" \",\"\") & \",\")\n         - LEN(SUBSTITUTE(\",\" & SUBSTITUTE($D$2:$D$500,\" \",\"\") & \",\", \",\" & _xlpm.id & \",\", \"\")))\n        / LEN(\",\" & _xlpm.id & \",\")\n      )\n    )\n  )\n)","v":"11029: 4 | 11018: 4 | 11009: 3 | 12030: 4 | 11024: 4"},null,null,null,null,"싸이클롭스2",11025,"Range"]
["스테이지 4-4",null,"미노타우르스 광전사4, 미노타우르스 챔피언4, 미노타우르스 챔피언5, 싸이클롭스2, 오크 궁수1, 오크 궁수2",{"$f":"_xlfn.TEXTJOIN(\", \", TRUE,\n    _xlfn.MAP(TRIM(_xlfn.TEXTSPLIT(C23, \",\")),\n        _xlfn.LAMBDA(_xlpm.n,\n            _xlfn.LET(\n                _xlpm.result, _xlfn.XLOOKUP(_xlpm.n, J:J, K:K, \"\"),\n                IF(_xlpm.result = \"\", _xlpm.n, _xlpm.result)\n            )\n        )\n    )\n)","v":"11012, 11018, 11019, 11025, 12028, 12029"},{"$f":"_xlfn.TEXTJOIN(\" | \", TRUE,\n  _xlfn.MAP(TRIM(_xlfn.TEXTSPLIT(D23, \",\")),\n    _xlfn.LAMBDA(_xlpm.id,\n      _xlpm.id & \": \" &\n      SUMPRODUCT(\n        (LEN(\",\" & SUBSTITUTE($D$2:$D$500,\" \",\"\") & \",\")\n         - LEN(SUBSTITUTE(\",\" & SUBSTITUTE($D$2:$D$500,\" \",\"\") & \",\", \",\" & _xlpm.id & \",\", \"\")))\n        / LEN(\",\" & _xlpm.id & \",\")\n      )\n    )\n  )\n)","v":"11012: 3 | 11018: 4 | 11019: 3 | 11025: 3 | 12028: 4 | 12029: 4"},"흑기사2",10007,null,null,"놀강도4",11006,"Melee"]
["스테이지 4-5",null,"미노타우르스 광전사4, 트롤1, 미노타우르스 챔피언4, 미노타우르스 챔피언5, 오크 마법사2",{"$f":"_xlfn.TEXTJOIN(\", \", TRUE,\n    _xlfn.MAP(TRIM(_xlfn.TEXTSPLIT(C24, \",\")),\n        _xlfn.LAMBDA(_xlpm.n,\n            _xlfn.LET(\n                _xlpm.result, _xlfn.XLOOKUP(_xlpm.n, J:J, K:K, \"\"),\n                IF(_xlpm.result = \"\", _xlpm.n, _xlpm.result)\n            )\n        )\n    )\n)","v":"11012, 11029, 11018, 11019, 12031"},{"$f":"_xlfn.TEXTJOIN(\" | \", TRUE,\n  _xlfn.MAP(TRIM(_xlfn.TEXTSPLIT(D24, \",\")),\n    _xlfn.LAMBDA(_xlpm.id,\n      _xlpm.id & \": \" &\n      SUMPRODUCT(\n        (LEN(\",\" & SUBSTITUTE($D$2:$D$500,\" \",\"\") & \",\")\n         - LEN(SUBSTITUTE(\",\" & SUBSTITUTE($D$2:$D$500,\" \",\"\") & \",\", \",\" & _xlpm.id & \",\", \"\")))\n        / LEN(\",\" & _xlpm.id & \",\")\n      )\n    )\n  )\n)","v":"11012: 3 | 11029: 4 | 11018: 4 | 11019: 3 | 12031: 4"},null,null,null,null,"트롤1",11029,"Melee"]
["스테이지 4-6",null,"미노타우로스 도살자2, 미노타우르스 광전사4, 오크 궁수1, 싸이클롭스1, 싸이클롭스2, 트롤1",{"$f":"_xlfn.TEXTJOIN(\", \", TRUE,\n    _xlfn.MAP(TRIM(_xlfn.TEXTSPLIT(C25, \",\")),\n        _xlfn.LAMBDA(_xlpm.n,\n            _xlfn.LET(\n                _xlpm.result, _xlfn.XLOOKUP(_xlpm.n, J:J, K:K, \"\"),\n                IF(_xlpm.result = \"\", _xlpm.n, _xlpm.result)\n            )\n        )\n    )\n)","v":"11014, 11012, 12028, 11024, 11025, 11029"},{"$f":"_xlfn.TEXTJOIN(\" | \", TRUE,\n  _xlfn.MAP(TRIM(_xlfn.TEXTSPLIT(D25, \",\")),\n    _xlfn.LAMBDA(_xlpm.id,\n      _xlpm.id & \": \" &\n      SUMPRODUCT(\n        (LEN(\",\" & SUBSTITUTE($D$2:$D$500,\" \",\"\") & \",\")\n         - LEN(SUBSTITUTE(\",\" & SUBSTITUTE($D$2:$D$500,\" \",\"\") & \",\", \",\" & _xlpm.id & \",\", \"\")))\n        / LEN(\",\" & _xlpm.id & \",\")\n      )\n    )\n  )\n)","v":"11014: 3 | 11012: 3 | 12028: 4 | 11024: 4 | 11025: 3 | 11029: 4"},"늑대인간",10008,null,null,"오크 궁수1",12028,"Range"]
["스테이지 4-7",null,"미노타우르스 챔피언4, 미노타우르스 챔피언5, 싸이클롭스1, 싸이클롭스2, 오크 마법사2, 오크 마법사1",{"$f":"_xlfn.TEXTJOIN(\", \", TRUE,\n    _xlfn.MAP(TRIM(_xlfn.TEXTSPLIT(C26, \",\")),\n        _xlfn.LAMBDA(_xlpm.n,\n            _xlfn.LET(\n                _xlpm.result, _xlfn.XLOOKUP(_xlpm.n, J:J, K:K, \"\"),\n                IF(_xlpm.result = \"\", _xlpm.n, _xlpm.result)\n            )\n        )\n    )\n)","v":"11018, 11019, 11024, 11025, 12031, 12030"},{"$f":"_xlfn.TEXTJOIN(\" | \", TRUE,\n  _xlfn.MAP(TRIM(_xlfn.TEXTSPLIT(D26, \",\")),\n    _xlfn.LAMBDA(_xlpm.id,\n      _xlpm.id & \": \" &\n      SUMPRODUCT(\n        (LEN(\",\" & SUBSTITUTE($D$2:$D$500,\" \",\"\") & \",\")\n         - LEN(SUBSTITUTE(\",\" & SUBSTITUTE($D$2:$D$500,\" \",\"\") & \",\", \",\" & _xlpm.id & \",\", \"\")))\n        / LEN(\",\" & _xlpm.id & \",\")\n      )\n    )\n  )\n)","v":"11018: 4 | 11019: 3 | 11024: 4 | 11025: 3 | 12031: 4 | 12030: 4"},"늑대인간",10008,null,null,"오크1",12032,"Melee"]
[null,null,null,null,null,null,null,null,null,"사악한 악령1",13014,"Melee"]
["스테이지 5-1","③ 고블린 성채","고블린1, 고블린 아처1, 살인 청부업자3, 광전사6, 고블린 라이더2",{"$f":"_xlfn.TEXTJOIN(\", \", TRUE,\n    _xlfn.MAP(TRIM(_xlfn.TEXTSPLIT(C28, \",\")),\n        _xlfn.LAMBDA(_xlpm.n,\n            _xlfn.LET(\n                _xlpm.result, _xlfn.XLOOKUP(_xlpm.n, J:J, K:K, \"\"),\n                IF(_xlpm.result = \"\", _xlpm.n, _xlpm.result)\n            )\n        )\n    )\n)","v":"12004, 12007, 12024, 12013, 12006"},{"$f":"_xlfn.TEXTJOIN(\" | \", TRUE,\n  _xlfn.MAP(TRIM(_xlfn.TEXTSPLIT(D28, \",\")),\n    _xlfn.LAMBDA(_xlpm.id,\n      _xlpm.id & \": \" &\n      SUMPRODUCT(\n        (LEN(\",\" & SUBSTITUTE($D$2:$D$500,\" \",\"\") & \",\")\n         - LEN(SUBSTITUTE(\",\" & SUBSTITUTE($D$2:$D$500,\" \",\"\") & \",\", \",\" & _xlpm.id & \",\", \"\")))\n        / LEN(\",\" & _xlpm.id & \",\")\n      )\n    )\n  )\n)","v":"12004: 4 | 12007: 5 | 12024: 4 | 12013: 4 | 12006: 4"},"대사탄1",10009,null,null,"놀강도1",11004,"Melee"]
["스테이지 5-2",null,"고블린1, 고블린 라이더1, 고블린 아처1, 고블린 라이더2",{"$f":"_xlfn.TEXTJOIN(\", \", TRUE,\n    _xlfn.MAP(TRIM(_xlfn.TEXTSPLIT(C29, \",\")),\n        _xlfn.LAMBDA(_xlpm.n,\n            _xlfn.LET(\n                _xlpm.result, _xlfn.XLOOKUP(_xlpm.n, J:J, K:K, \"\"),\n                IF(_xlpm.result = \"\", _xlpm.n, _xlpm.result)\n            )\n        )\n    )\n)","v":"12004, 12005, 12007, 12006"},{"$f":"_xlfn.TEXTJOIN(\" | \", TRUE,\n  _xlfn.MAP(TRIM(_xlfn.TEXTSPLIT(D29, \",\")),\n    _xlfn.LAMBDA(_xlpm.id,\n      _xlpm.id & \": \" &\n      SUMPRODUCT(\n        (LEN(\",\" & SUBSTITUTE($D$2:$D$500,\" \",\"\") & \",\")\n         - LEN(SUBSTITUTE(\",\" & SUBSTITUTE($D$2:$D$500,\" \",\"\") & \",\", \",\" & _xlpm.id & \",\", \"\")))\n        / LEN(\",\" & _xlpm.id & \",\")\n      )\n    )\n  )\n)","v":"12004: 4 | 12005: 3 | 12007: 5 | 12006: 4"},null,null,null,null,"오크 마법사2",12031,"Range"]
["스테이지 5-3",null,"광전사6, 살인 청부업자3, 살인 청부업자2, 악마 광신자2, 연쇄살인마3",{"$f":"_xlfn.TEXTJOIN(\", \", TRUE,\n    _xlfn.MAP(TRIM(_xlfn.TEXTSPLIT(C30, \",\")),\n        _xlfn.LAMBDA(_xlpm.n,\n            _xlfn.LET(\n                _xlpm.result, _xlfn.XLOOKUP(_xlpm.n, J:J, K:K, \"\"),\n                IF(_xlpm.result = \"\", _xlpm.n, _xlpm.result)\n            )\n        )\n    )\n)","v":"12013, 12024, 12023, 13017, 12027"},{"$f":"_xlfn.TEXTJOIN(\" | \", TRUE,\n  _xlfn.MAP(TRIM(_xlfn.TEXTSPLIT(D30, \",\")),\n    _xlfn.LAMBDA(_xlpm.id,\n      _xlpm.id & \": \" &\n      SUMPRODUCT(\n        (LEN(\",\" & SUBSTITUTE($D$2:$D$500,\" \",\"\") & \",\")\n         - LEN(SUBSTITUTE(\",\" & SUBSTITUTE($D$2:$D$500,\" \",\"\") & \",\", \",\" & _xlpm.id & \",\", \"\")))\n        / LEN(\",\" & _xlpm.id & \",\")\n      )\n    )\n  )\n)","v":"12013: 4 | 12024: 4 | 12023: 6 | 13017: 5 | 12027: 4"},"대사탄1",10009,null,null,"오크2",12033,"Melee"]
["스테이지 5-4",null,"고블린1, 고블린 라이더1, 고블린 아처1, 연쇄살인마3, 연쇄살인마1",{"$f":"_xlfn.TEXTJOIN(\", \", TRUE,\n    _xlfn.MAP(TRIM(_xlfn.TEXTSPLIT(C31, \",\")),\n        _xlfn.LAMBDA(_xlpm.n,\n            _xlfn.LET(\n                _xlpm.result, _xlfn.XLOOKUP(_xlpm.n, J:J, K:K, \"\"),\n                IF(_xlpm.result = \"\", _xlpm.n, _xlpm.result)\n            )\n        )\n    )\n)","v":"12004, 12005, 12007, 12027, 12025"},{"$f":"_xlfn.TEXTJOIN(\" | \", TRUE,\n  _xlfn.MAP(TRIM(_xlfn.TEXTSPLIT(D31, \",\")),\n    _xlfn.LAMBDA(_xlpm.id,\n      _xlpm.id & \": \" &\n      SUMPRODUCT(\n        (LEN(\",\" & SUBSTITUTE($D$2:$D$500,\" \",\"\") & \",\")\n         - LEN(SUBSTITUTE(\",\" & SUBSTITUTE($D$2:$D$500,\" \",\"\") & \",\", \",\" & _xlpm.id & \",\", \"\")))\n        / LEN(\",\" & _xlpm.id & \",\")\n      )\n    )\n  )\n)","v":"12004: 4 | 12005: 3 | 12007: 5 | 12027: 4 | 12025: 6"},null,null,null,null,"데스웜",14012,"Melee"]
["스테이지 5-5",null,"고블린1, 고블린 라이더2, 활든 강도3, 악마 광신자2, 광전사6",{"$f":"_xlfn.TEXTJOIN(\", \", TRUE,\n    _xlfn.MAP(TRIM(_xlfn.TEXTSPLIT(C32, \",\")),\n        _xlfn.LAMBDA(_xlpm.n,\n            _xlfn.LET(\n                _xlpm.result, _xlfn.XLOOKUP(_xlpm.n, J:J, K:K, \"\"),\n                IF(_xlpm.result = \"\", _xlpm.n, _xlpm.result)\n            )\n        )\n    )\n)","v":"12004, 12006, 12037, 13017, 12013"},{"$f":"_xlfn.TEXTJOIN(\" | \", TRUE,\n  _xlfn.MAP(TRIM(_xlfn.TEXTSPLIT(D32, \",\")),\n    _xlfn.LAMBDA(_xlpm.id,\n      _xlpm.id & \": \" &\n      SUMPRODUCT(\n        (LEN(\",\" & SUBSTITUTE($D$2:$D$500,\" \",\"\") & \",\")\n         - LEN(SUBSTITUTE(\",\" & SUBSTITUTE($D$2:$D$500,\" \",\"\") & \",\", \",\" & _xlpm.id & \",\", \"\")))\n        / LEN(\",\" & _xlpm.id & \",\")\n      )\n    )\n  )\n)","v":"12004: 4 | 12006: 4 | 12037: 4 | 13017: 5 | 12013: 4"},"다크엘프 아처1",10010,null,null,"싸이클롭스1",11024,"Range"]
["스테이지 5-6",null,"활든 강도3, 살인 청부업자2, 연쇄살인마1, 살인 청부업자3, 연쇄살인마3",{"$f":"_xlfn.TEXTJOIN(\", \", TRUE,\n    _xlfn.MAP(TRIM(_xlfn.TEXTSPLIT(C33, \",\")),\n        _xlfn.LAMBDA(_xlpm.n,\n            _xlfn.LET(\n                _xlpm.result, _xlfn.XLOOKUP(_xlpm.n, J:J, K:K, \"\"),\n                IF(_xlpm.result = \"\", _xlpm.n, _xlpm.result)\n            )\n        )\n    )\n)","v":"12037, 12023, 12025, 12024, 12027"},{"$f":"_xlfn.TEXTJOIN(\" | \", TRUE,\n  _xlfn.MAP(TRIM(_xlfn.TEXTSPLIT(D33, \",\")),\n    _xlfn.LAMBDA(_xlpm.id,\n      _xlpm.id & \": \" &\n      SUMPRODUCT(\n        (LEN(\",\" & SUBSTITUTE($D$2:$D$500,\" \",\"\") & \",\")\n         - LEN(SUBSTITUTE(\",\" & SUBSTITUTE($D$2:$D$500,\" \",\"\") & \",\", \",\" & _xlpm.id & \",\", \"\")))\n        / LEN(\",\" & _xlpm.id & \",\")\n      )\n    )\n  )\n)","v":"12037: 4 | 12023: 6 | 12025: 6 | 12024: 4 | 12027: 4"},"다크엘프 아처1",10010,null,null,"오크 궁수2",12029,"Range"]
[null,null,null,null,null,null,null,null,null,"오크 마법사1",12030,"Range"]
["스테이지 6-1","③ 악마의 은신처","고블린 라이더1, 고블린 아처1, 고블린 라이더2, 악마 광신자2, 살인 청부업자2",{"$f":"_xlfn.TEXTJOIN(\", \", TRUE,\n    _xlfn.MAP(TRIM(_xlfn.TEXTSPLIT(C35, \",\")),\n        _xlfn.LAMBDA(_xlpm.n,\n            _xlfn.LET(\n                _xlpm.result, _xlfn.XLOOKUP(_xlpm.n, J:J, K:K, \"\"),\n                IF(_xlpm.result = \"\", _xlpm.n, _xlpm.result)\n            )\n        )\n    )\n)","v":"12005, 12007, 12006, 13017, 12023"},{"$f":"_xlfn.TEXTJOIN(\" | \", TRUE,\n  _xlfn.MAP(TRIM(_xlfn.TEXTSPLIT(D35, \",\")),\n    _xlfn.LAMBDA(_xlpm.id,\n      _xlpm.id & \": \" &\n      SUMPRODUCT(\n        (LEN(\",\" & SUBSTITUTE($D$2:$D$500,\" \",\"\") & \",\")\n         - LEN(SUBSTITUTE(\",\" & SUBSTITUTE($D$2:$D$500,\" \",\"\") & \",\", \",\" & _xlpm.id & \",\", \"\")))\n        / LEN(\",\" & _xlpm.id & \",\")\n      )\n    )\n  )\n)","v":"12005: 3 | 12007: 5 | 12006: 4 | 13017: 5 | 12023: 6"},"대사탄2",10011,null,null,"미노타우르스 광전사4",11012,"Melee"]
["스테이지 6-2",null,"미노타우르스 광전사2, 광전사6, 다크엘프 마법사1, 살인 청부업자3, 고블린 아처1",{"$f":"_xlfn.TEXTJOIN(\", \", TRUE,\n    _xlfn.MAP(TRIM(_xlfn.TEXTSPLIT(C36, \",\")),\n        _xlfn.LAMBDA(_xlpm.n,\n            _xlfn.LET(\n                _xlpm.result, _xlfn.XLOOKUP(_xlpm.n, J:J, K:K, \"\"),\n                IF(_xlpm.result = \"\", _xlpm.n, _xlpm.result)\n            )\n        )\n    )\n)","v":"11010, 12013, 12017, 12024, 12007"},{"$f":"_xlfn.TEXTJOIN(\" | \", TRUE,\n  _xlfn.MAP(TRIM(_xlfn.TEXTSPLIT(D36, \",\")),\n    _xlfn.LAMBDA(_xlpm.id,\n      _xlpm.id & \": \" &\n      SUMPRODUCT(\n        (LEN(\",\" & SUBSTITUTE($D$2:$D$500,\" \",\"\") & \",\")\n         - LEN(SUBSTITUTE(\",\" & SUBSTITUTE($D$2:$D$500,\" \",\"\") & \",\", \",\" & _xlpm.id & \",\", \"\")))\n        / LEN(\",\" & _xlpm.id & \",\")\n      )\n    )\n  )\n)","v":"11010: 3 | 12013: 4 | 12017: 5 | 12024: 4 | 12007: 5"},null,null,null,null,"미노타우로스 도살자2",11014,"Melee"]
["스테이지 6-3",null,"미노타우르스 챔피언3, 버그베어2, 미노타우르스 광전사3, 연쇄살인마3, 다크엘프 마법사1, 연쇄살인마1",{"$f":"_xlfn.TEXTJOIN(\", \", TRUE,\n    _xlfn.MAP(TRIM(_xlfn.TEXTSPLIT(C37, \",\")),\n        _xlfn.LAMBDA(_xlpm.n,\n            _xlfn.LET(\n                _xlpm.result, _xlfn.XLOOKUP(_xlpm.n, J:J, K:K, \"\"),\n                IF(_xlpm.result = \"\", _xlpm.n, _xlpm.result)\n            )\n        )\n    )\n)","v":"11017, 11021, 11011, 12027, 12017, 12025"},{"$f":"_xlfn.TEXTJOIN(\" | \", TRUE,\n  _xlfn.MAP(TRIM(_xlfn.TEXTSPLIT(D37, \",\")),\n    _xlfn.LAMBDA(_xlpm.id,\n      _xlpm.id & \": \" &\n      SUMPRODUCT(\n        (LEN(\",\" & SUBSTITUTE($D$2:$D$500,\" \",\"\") & \",\")\n         - LEN(SUBSTITUTE(\",\" & SUBSTITUTE($D$2:$D$500,\" \",\"\") & \",\", \",\" & _xlpm.id & \",\", \"\")))\n        / LEN(\",\" & _xlpm.id & \",\")\n      )\n    )\n  )\n)","v":"11017: 3 | 11021: 3 | 11011: 3 | 12027: 4 | 12017: 5 | 12025: 6"},"대사탄2",10011,null,null,"미노타우르스 챔피언4",11018,"Melee"]
["스테이지 6-4",null,"버그베어4, 미노타우르스 광전사2, 미노타우르스 광전사3, 활든 강도3, 다크엘프 마법사1",{"$f":"_xlfn.TEXTJOIN(\", \", TRUE,\n    _xlfn.MAP(TRIM(_xlfn.TEXTSPLIT(C38, \",\")),\n        _xlfn.LAMBDA(_xlpm.n,\n            _xlfn.LET(\n                _xlpm.result, _xlfn.XLOOKUP(_xlpm.n, J:J, K:K, \"\"),\n                IF(_xlpm.result = \"\", _xlpm.n, _xlpm.result)\n            )\n        )\n    )\n)","v":"11023, 11010, 11011, 12037, 12017"},{"$f":"_xlfn.TEXTJOIN(\" | \", TRUE,\n  _xlfn.MAP(TRIM(_xlfn.TEXTSPLIT(D38, \",\")),\n    _xlfn.LAMBDA(_xlpm.id,\n      _xlpm.id & \": \" &\n      SUMPRODUCT(\n        (LEN(\",\" & SUBSTITUTE($D$2:$D$500,\" \",\"\") & \",\")\n         - LEN(SUBSTITUTE(\",\" & SUBSTITUTE($D$2:$D$500,\" \",\"\") & \",\", \",\" & _xlpm.id & \",\", \"\")))\n        / LEN(\",\" & _xlpm.id & \",\")\n      )\n    )\n  )\n)","v":"11023: 3 | 11010: 3 | 11011: 3 | 12037: 4 | 12017: 5"},null,null,null,null,"미노타우르스 챔피언5",11019,"Melee",null,null,10001,"놀아처1"]
["스테이지 6-5",null,"버그베어2, 버그베어3, 다크엘프 마법사1, 미노타우르스 챔피언3,  활든 강도3, 악마 광신자2",{"$f":"_xlfn.TEXTJOIN(\", \", TRUE,\n    _xlfn.MAP(TRIM(_xlfn.TEXTSPLIT(C39, \",\")),\n        _xlfn.LAMBDA(_xlpm.n,\n            _xlfn.LET(\n                _xlpm.result, _xlfn.XLOOKUP(_xlpm.n, J:J, K:K, \"\"),\n                IF(_xlpm.result = \"\", _xlpm.n, _xlpm.result)\n            )\n        )\n    )\n)","v":"11021, 11022, 12017, 11017, 12037, 13017"},{"$f":"_xlfn.TEXTJOIN(\" | \", TRUE,\n  _xlfn.MAP(TRIM(_xlfn.TEXTSPLIT(D39, \",\")),\n    _xlfn.LAMBDA(_xlpm.id,\n      _xlpm.id & \": \" &\n      SUMPRODUCT(\n        (LEN(\",\" & SUBSTITUTE($D$2:$D$500,\" \",\"\") & \",\")\n         - LEN(SUBSTITUTE(\",\" & SUBSTITUTE($D$2:$D$500,\" \",\"\") & \",\", \",\" & _xlpm.id & \",\", \"\")))\n        / LEN(\",\" & _xlpm.id & \",\")\n      )\n    )\n  )\n)","v":"11021: 3 | 11022: 3 | 12017: 5 | 11017: 3 | 12037: 4 | 13017: 5"},"데스나이트3",10012,null,null,"활든 강도2",12036,"Range",null,null,10002,"놀강도2"]
["스테이지 6-6",null,"연쇄살인마1, 살인 청부업자2, 버그베어4, 미노타우르스 광전사2, 미노타우르스 광전사3, 버그베어3",{"$f":"_xlfn.TEXTJOIN(\", \", TRUE,\n    _xlfn.MAP(TRIM(_xlfn.TEXTSPLIT(C40, \",\")),\n        _xlfn.LAMBDA(_xlpm.n,\n            _xlfn.LET(\n                _xlpm.result, _xlfn.XLOOKUP(_xlpm.n, J:J, K:K, \"\"),\n                IF(_xlpm.result = \"\", _xlpm.n, _xlpm.result)\n            )\n        )\n    )\n)","v":"12025, 12023, 11023, 11010, 11011, 11022"},{"$f":"_xlfn.TEXTJOIN(\" | \", TRUE,\n  _xlfn.MAP(TRIM(_xlfn.TEXTSPLIT(D40, \",\")),\n    _xlfn.LAMBDA(_xlpm.id,\n      _xlpm.id & \": \" &\n      SUMPRODUCT(\n        (LEN(\",\" & SUBSTITUTE($D$2:$D$500,\" \",\"\") & \",\")\n         - LEN(SUBSTITUTE(\",\" & SUBSTITUTE($D$2:$D$500,\" \",\"\") & \",\", \",\" & _xlpm.id & \",\", \"\")))\n        / LEN(\",\" & _xlpm.id & \",\")\n      )\n    )\n  )\n)","v":"12025: 6 | 12023: 6 | 11023: 3 | 11010: 3 | 11011: 3 | 11022: 3"},null,null,null,3,"버그베어2",11021,"Melee",null,null,10003,"임프전사1",1]
["스테이지 6-7",null,"미노타우르스 챔피언3, 버그베어2, 버그베어3, 버그베어4, 악마 광신자2, 다크엘프 마법사1",{"$f":"_xlfn.TEXTJOIN(\", \", TRUE,\n    _xlfn.MAP(TRIM(_xlfn.TEXTSPLIT(C41, \",\")),\n        _xlfn.LAMBDA(_xlpm.n,\n            _xlfn.LET(\n                _xlpm.result, _xlfn.XLOOKUP(_xlpm.n, J:J, K:K, \"\"),\n                IF(_xlpm.result = \"\", _xlpm.n, _xlpm.result)\n            )\n        )\n    )\n)","v":"11017, 11021, 11022, 11023, 13017, 12017"},{"$f":"_xlfn.TEXTJOIN(\" | \", TRUE,\n  _xlfn.MAP(TRIM(_xlfn.TEXTSPLIT(D41, \",\")),\n    _xlfn.LAMBDA(_xlpm.id,\n      _xlpm.id & \": \" &\n      SUMPRODUCT(\n        (LEN(\",\" & SUBSTITUTE($D$2:$D$500,\" \",\"\") & \",\")\n         - LEN(SUBSTITUTE(\",\" & SUBSTITUTE($D$2:$D$500,\" \",\"\") & \",\", \",\" & _xlpm.id & \",\", \"\")))\n        / LEN(\",\" & _xlpm.id & \",\")\n      )\n    )\n  )\n)","v":"11017: 3 | 11021: 3 | 11022: 3 | 11023: 3 | 13017: 5 | 12017: 5"},"데스나이트3",10012,null,null,"버그베어3",11022,"Melee",null,null,10004,"오우거1"]
[null,null,null,null,null,null,null,null,null,"버그베어4",11023,"Melee",null,null,10005,"바포메트6"]
["스테이지 7-1","④ 죽음의 회랑","데스1, 해골 궁수, 해골 근위병, 광전사1",{"$f":"_xlfn.TEXTJOIN(\", \", TRUE,\n    _xlfn.MAP(TRIM(_xlfn.TEXTSPLIT(C43, \",\")),\n        _xlfn.LAMBDA(_xlpm.n,\n            _xlfn.LET(\n                _xlpm.result, _xlfn.XLOOKUP(_xlpm.n, J:J, K:K, \"\"),\n                IF(_xlpm.result = \"\", _xlpm.n, _xlpm.result)\n            )\n        )\n    )\n)","v":"13004, 13028, 13029, 12008"},{"$f":"_xlfn.TEXTJOIN(\" | \", TRUE,\n  _xlfn.MAP(TRIM(_xlfn.TEXTSPLIT(D43, \",\")),\n    _xlfn.LAMBDA(_xlpm.id,\n      _xlpm.id & \": \" &\n      SUMPRODUCT(\n        (LEN(\",\" & SUBSTITUTE($D$2:$D$500,\" \",\"\") & \",\")\n         - LEN(SUBSTITUTE(\",\" & SUBSTITUTE($D$2:$D$500,\" \",\"\") & \",\", \",\" & _xlpm.id & \",\", \"\")))\n        / LEN(\",\" & _xlpm.id & \",\")\n      )\n    )\n  )\n)","v":"13004: 5 | 13028: 5 | 13029: 5 | 12008: 5"},null,null,null,null,"다크엘프 마법사1",12017,"Range",null,null,10006,"거미여왕2"]
["스테이지 7-2",null,"데스1, 해골 궁수, 해골 근위병, 사악한 악령2",{"$f":"_xlfn.TEXTJOIN(\", \", TRUE,\n    _xlfn.MAP(TRIM(_xlfn.TEXTSPLIT(C44, \",\")),\n        _xlfn.LAMBDA(_xlpm.n,\n            _xlfn.LET(\n                _xlpm.result, _xlfn.XLOOKUP(_xlpm.n, J:J, K:K, \"\"),\n                IF(_xlpm.result = \"\", _xlpm.n, _xlpm.result)\n            )\n        )\n    )\n)","v":"13004, 13028, 13029, 13015"},{"$f":"_xlfn.TEXTJOIN(\" | \", TRUE,\n  _xlfn.MAP(TRIM(_xlfn.TEXTSPLIT(D44, \",\")),\n    _xlfn.LAMBDA(_xlpm.id,\n      _xlpm.id & \": \" &\n      SUMPRODUCT(\n        (LEN(\",\" & SUBSTITUTE($D$2:$D$500,\" \",\"\") & \",\")\n         - LEN(SUBSTITUTE(\",\" & SUBSTITUTE($D$2:$D$500,\" \",\"\") & \",\", \",\" & _xlpm.id & \",\", \"\")))\n        / LEN(\",\" & _xlpm.id & \",\")\n      )\n    )\n  )\n)","v":"13004: 5 | 13028: 5 | 13029: 5 | 13015: 5"},"메두사1",10013,null,null,"연쇄살인마1",12025,"Melee",null,null,10007,"흑기사2",2]
["스테이지 7-3",null,"데스2, 해골 기사1, 사악한 악령2, 타락한 기사2",{"$f":"_xlfn.TEXTJOIN(\", \", TRUE,\n    _xlfn.MAP(TRIM(_xlfn.TEXTSPLIT(C45, \",\")),\n        _xlfn.LAMBDA(_xlpm.n,\n            _xlfn.LET(\n                _xlpm.result, _xlfn.XLOOKUP(_xlpm.n, J:J, K:K, \"\"),\n                IF(_xlpm.result = \"\", _xlpm.n, _xlpm.result)\n            )\n        )\n    )\n)","v":"13005, 13031, 13015, 13026"},{"$f":"_xlfn.TEXTJOIN(\" | \", TRUE,\n  _xlfn.MAP(TRIM(_xlfn.TEXTSPLIT(D45, \",\")),\n    _xlfn.LAMBDA(_xlpm.id,\n      _xlpm.id & \": \" &\n      SUMPRODUCT(\n        (LEN(\",\" & SUBSTITUTE($D$2:$D$500,\" \",\"\") & \",\")\n         - LEN(SUBSTITUTE(\",\" & SUBSTITUTE($D$2:$D$500,\" \",\"\") & \",\", \",\" & _xlpm.id & \",\", \"\")))\n        / LEN(\",\" & _xlpm.id & \",\")\n      )\n    )\n  )\n)","v":"13005: 5 | 13031: 5 | 13015: 5 | 13026: 5"},null,null,null,null,"미노타우르스 광전사2",11010,"Melee",null,null,10008,"늑대인간"]
["스테이지 7-4",null,"데스2, 해골 근위병, 해골 기사1, 임프 사역마1, 악마 광신자4",{"$f":"_xlfn.TEXTJOIN(\", \", TRUE,\n    _xlfn.MAP(TRIM(_xlfn.TEXTSPLIT(C46, \",\")),\n        _xlfn.LAMBDA(_xlpm.n,\n            _xlfn.LET(\n                _xlpm.result, _xlfn.XLOOKUP(_xlpm.n, J:J, K:K, \"\"),\n                IF(_xlpm.result = \"\", _xlpm.n, _xlpm.result)\n            )\n        )\n    )\n)","v":"13005, 13029, 13031, 13023, 13019"},{"$f":"_xlfn.TEXTJOIN(\" | \", TRUE,\n  _xlfn.MAP(TRIM(_xlfn.TEXTSPLIT(D46, \",\")),\n    _xlfn.LAMBDA(_xlpm.id,\n      _xlpm.id & \": \" &\n      SUMPRODUCT(\n        (LEN(\",\" & SUBSTITUTE($D$2:$D$500,\" \",\"\") & \",\")\n         - LEN(SUBSTITUTE(\",\" & SUBSTITUTE($D$2:$D$500,\" \",\"\") & \",\", \",\" & _xlpm.id & \",\", \"\")))\n        / LEN(\",\" & _xlpm.id & \",\")\n      )\n    )\n  )\n)","v":"13005: 5 | 13029: 5 | 13031: 5 | 13023: 5 | 13019: 5"},"메두사1",10013,null,null,"미노타우르스 광전사3",11011,"Melee",null,null,10009,"대사탄1"]
[null,null,null,null,null,null,null,null,null,"살인 청부업자3",12024,"Melee",null,null,10010,"다크엘프 아처1"]
["스테이지 8-1","④ 네크로멘서 실험실","머미1, 머미2, 네크로멘서1, 네크로멘서2, 악마 광신자4",{"$f":"_xlfn.TEXTJOIN(\", \", TRUE,\n    _xlfn.MAP(TRIM(_xlfn.TEXTSPLIT(C48, \",\")),\n        _xlfn.LAMBDA(_xlpm.n,\n            _xlfn.LET(\n                _xlpm.result, _xlfn.XLOOKUP(_xlpm.n, J:J, K:K, \"\"),\n                IF(_xlpm.result = \"\", _xlpm.n, _xlpm.result)\n            )\n        )\n    )\n)","v":"13007, 13008, 13001, 13002, 13019"},{"$f":"_xlfn.TEXTJOIN(\" | \", TRUE,\n  _xlfn.MAP(TRIM(_xlfn.TEXTSPLIT(D48, \",\")),\n    _xlfn.LAMBDA(_xlpm.id,\n      _xlpm.id & \": \" &\n      SUMPRODUCT(\n        (LEN(\",\" & SUBSTITUTE($D$2:$D$500,\" \",\"\") & \",\")\n         - LEN(SUBSTITUTE(\",\" & SUBSTITUTE($D$2:$D$500,\" \",\"\") & \",\", \",\" & _xlpm.id & \",\", \"\")))\n        / LEN(\",\" & _xlpm.id & \",\")\n      )\n    )\n  )\n)","v":"13007: 5 | 13008: 5 | 13001: 5 | 13002: 5 | 13019: 5"},"메두사1",10013,null,null,"활든 강도3",12037,"Range",null,null,10011,"대사탄2",3]
["스테이지 8-2",null,"머미1, 머미2, 해골 궁수, 네크로멘서2, 네크로멘서1",{"$f":"_xlfn.TEXTJOIN(\", \", TRUE,\n    _xlfn.MAP(TRIM(_xlfn.TEXTSPLIT(C49, \",\")),\n        _xlfn.LAMBDA(_xlpm.n,\n            _xlfn.LET(\n                _xlpm.result, _xlfn.XLOOKUP(_xlpm.n, J:J, K:K, \"\"),\n                IF(_xlpm.result = \"\", _xlpm.n, _xlpm.result)\n            )\n        )\n    )\n)","v":"13007, 13008, 13028, 13002, 13001"},{"$f":"_xlfn.TEXTJOIN(\" | \", TRUE,\n  _xlfn.MAP(TRIM(_xlfn.TEXTSPLIT(D49, \",\")),\n    _xlfn.LAMBDA(_xlpm.id,\n      _xlpm.id & \": \" &\n      SUMPRODUCT(\n        (LEN(\",\" & SUBSTITUTE($D$2:$D$500,\" \",\"\") & \",\")\n         - LEN(SUBSTITUTE(\",\" & SUBSTITUTE($D$2:$D$500,\" \",\"\") & \",\", \",\" & _xlpm.id & \",\", \"\")))\n        / LEN(\",\" & _xlpm.id & \",\")\n      )\n    )\n  )\n)","v":"13007: 5 | 13008: 5 | 13028: 5 | 13002: 5 | 13001: 5"},null,null,null,null,"미노타우르스 챔피언3",11017,"Melee",null,null,10012,"데스나이트3"]
["스테이지 8-3",null,"머미2, 네크로멘서1, 네크로멘서2, 사악한 악령2, 임프 사역마1, 악마 광신자4",{"$f":"_xlfn.TEXTJOIN(\", \", TRUE,\n    _xlfn.MAP(TRIM(_xlfn.TEXTSPLIT(C50, \",\")),\n        _xlfn.LAMBDA(_xlpm.n,\n            _xlfn.LET(\n                _xlpm.result, _xlfn.XLOOKUP(_xlpm.n, J:J, K:K, \"\"),\n                IF(_xlpm.result = \"\", _xlpm.n, _xlpm.result)\n            )\n        )\n    )\n)","v":"13008, 13001, 13002, 13015, 13023, 13019"},{"$f":"_xlfn.TEXTJOIN(\" | \", TRUE,\n  _xlfn.MAP(TRIM(_xlfn.TEXTSPLIT(D50, \",\")),\n    _xlfn.LAMBDA(_xlpm.id,\n      _xlpm.id & \": \" &\n      SUMPRODUCT(\n        (LEN(\",\" & SUBSTITUTE($D$2:$D$500,\" \",\"\") & \",\")\n         - LEN(SUBSTITUTE(\",\" & SUBSTITUTE($D$2:$D$500,\" \",\"\") & \",\", \",\" & _xlpm.id & \",\", \"\")))\n        / LEN(\",\" & _xlpm.id & \",\")\n      )\n    )\n  )\n)","v":"13008: 5 | 13001: 5 | 13002: 5 | 13015: 5 | 13023: 5 | 13019: 5"},"바포메트2",10014,null,null,"광전사6",12013,"Melee",null,null,10013,"메두사1"]
["스테이지 8-4",null,"악마 광신자4, 해골 근위병, 타락한 기사2, 네크로멘서1, 머미1, 해골 궁수",{"$f":"_xlfn.TEXTJOIN(\", \", TRUE,\n    _xlfn.MAP(TRIM(_xlfn.TEXTSPLIT(C51, \",\")),\n        _xlfn.LAMBDA(_xlpm.n,\n            _xlfn.LET(\n                _xlpm.result, _xlfn.XLOOKUP(_xlpm.n, J:J, K:K, \"\"),\n                IF(_xlpm.result = \"\", _xlpm.n, _xlpm.result)\n            )\n        )\n    )\n)","v":"13019, 13029, 13026, 13001, 13007, 13028"},{"$f":"_xlfn.TEXTJOIN(\" | \", TRUE,\n  _xlfn.MAP(TRIM(_xlfn.TEXTSPLIT(D51, \",\")),\n    _xlfn.LAMBDA(_xlpm.id,\n      _xlpm.id & \": \" &\n      SUMPRODUCT(\n        (LEN(\",\" & SUBSTITUTE($D$2:$D$500,\" \",\"\") & \",\")\n         - LEN(SUBSTITUTE(\",\" & SUBSTITUTE($D$2:$D$500,\" \",\"\") & \",\", \",\" & _xlpm.id & \",\", \"\")))\n        / LEN(\",\" & _xlpm.id & \",\")\n      )\n    )\n  )\n)","v":"13019: 5 | 13029: 5 | 13026: 5 | 13001: 5 | 13007: 5 | 13028: 5"},null,null,null,null,"살인 청부업자2",12023,"Melee",null,null,10014,"바포메트2",4]
["스테이지 8-5",null,"머미1, 머미2, 네크로멘서2, 임프 사역마1, 데스1, 데스2",{"$f":"_xlfn.TEXTJOIN(\", \", TRUE,\n    _xlfn.MAP(TRIM(_xlfn.TEXTSPLIT(C52, \",\")),\n        _xlfn.LAMBDA(_xlpm.n,\n            _xlfn.LET(\n                _xlpm.result, _xlfn.XLOOKUP(_xlpm.n, J:J, K:K, \"\"),\n                IF(_xlpm.result = \"\", _xlpm.n, _xlpm.result)\n            )\n        )\n    )\n)","v":"13007, 13008, 13002, 13023, 13004, 13005"},{"$f":"_xlfn.TEXTJOIN(\" | \", TRUE,\n  _xlfn.MAP(TRIM(_xlfn.TEXTSPLIT(D52, \",\")),\n    _xlfn.LAMBDA(_xlpm.id,\n      _xlpm.id & \": \" &\n      SUMPRODUCT(\n        (LEN(\",\" & SUBSTITUTE($D$2:$D$500,\" \",\"\") & \",\")\n         - LEN(SUBSTITUTE(\",\" & SUBSTITUTE($D$2:$D$500,\" \",\"\") & \",\", \",\" & _xlpm.id & \",\", \"\")))\n        / LEN(\",\" & _xlpm.id & \",\")\n      )\n    )\n  )\n)","v":"13007: 5 | 13008: 5 | 13002: 5 | 13023: 5 | 13004: 5 | 13005: 5"},"바포메트2",10014,null,null,"연쇄살인마3",12027,"Melee",null,null,10015,"트롤 워리어4"]
[null,null,null,null,null,null,null,null,null,"악마 광신자2",13017,"Range",null,null,10016,"흑기사3"]
["스테이지 9-1","④ 거인의 신전","광전사1, 해골 근위병, 임프 사역마1, 해골 기사1, 광전사5",{"$f":"_xlfn.TEXTJOIN(\", \", TRUE,\n    _xlfn.MAP(TRIM(_xlfn.TEXTSPLIT(C54, \",\")),\n        _xlfn.LAMBDA(_xlpm.n,\n            _xlfn.LET(\n                _xlpm.result, _xlfn.XLOOKUP(_xlpm.n, J:J, K:K, \"\"),\n                IF(_xlpm.result = \"\", _xlpm.n, _xlpm.result)\n            )\n        )\n    )\n)","v":"12008, 13029, 13023, 13031, 12012"},{"$f":"_xlfn.TEXTJOIN(\" | \", TRUE,\n  _xlfn.MAP(TRIM(_xlfn.TEXTSPLIT(D54, \",\")),\n    _xlfn.LAMBDA(_xlpm.id,\n      _xlpm.id & \": \" &\n      SUMPRODUCT(\n        (LEN(\",\" & SUBSTITUTE($D$2:$D$500,\" \",\"\") & \",\")\n         - LEN(SUBSTITUTE(\",\" & SUBSTITUTE($D$2:$D$500,\" \",\"\") & \",\", \",\" & _xlpm.id & \",\", \"\")))\n        / LEN(\",\" & _xlpm.id & \",\")\n      )\n    )\n  )\n)","v":"12008: 5 | 13029: 5 | 13023: 5 | 13031: 5 | 12012: 5"},null,null,null,null,"고블린1",12004,"Melee",null,null,10017,"흡혈귀여왕2",5]
["스테이지 9-2",null,"광전사3, 광전사1, 사악한 악령2,  해골 기사1, 네크로멘서2, 타락한 기사2, 광전사5",{"$f":"_xlfn.TEXTJOIN(\", \", TRUE,\n    _xlfn.MAP(TRIM(_xlfn.TEXTSPLIT(C55, \",\")),\n        _xlfn.LAMBDA(_xlpm.n,\n            _xlfn.LET(\n                _xlpm.result, _xlfn.XLOOKUP(_xlpm.n, J:J, K:K, \"\"),\n                IF(_xlpm.result = \"\", _xlpm.n, _xlpm.result)\n            )\n        )\n    )\n)","v":"12010, 12008, 13015, 13031, 13002, 13026, 12012"},{"$f":"_xlfn.TEXTJOIN(\" | \", TRUE,\n  _xlfn.MAP(TRIM(_xlfn.TEXTSPLIT(D55, \",\")),\n    _xlfn.LAMBDA(_xlpm.id,\n      _xlpm.id & \": \" &\n      SUMPRODUCT(\n        (LEN(\",\" & SUBSTITUTE($D$2:$D$500,\" \",\"\") & \",\")\n         - LEN(SUBSTITUTE(\",\" & SUBSTITUTE($D$2:$D$500,\" \",\"\") & \",\", \",\" & _xlpm.id & \",\", \"\")))\n        / LEN(\",\" & _xlpm.id & \",\")\n      )\n    )\n  )\n)","v":"12010: 5 | 12008: 5 | 13015: 5 | 13031: 5 | 13002: 5 | 13026: 5 | 12012: 5"},"바포메트2",10014,null,null,"고블린 라이더1",12005,"Melee",null,null,10018,"에티4"]
["스테이지 9-3",null,"데스1, 데스2, 광전사3, 머미1, 임프 사역마1, 광전사1",{"$f":"_xlfn.TEXTJOIN(\", \", TRUE,\n    _xlfn.MAP(TRIM(_xlfn.TEXTSPLIT(C56, \",\")),\n        _xlfn.LAMBDA(_xlpm.n,\n            _xlfn.LET(\n                _xlpm.result, _xlfn.XLOOKUP(_xlpm.n, J:J, K:K, \"\"),\n                IF(_xlpm.result = \"\", _xlpm.n, _xlpm.result)\n            )\n        )\n    )\n)","v":"13004, 13005, 12010, 13007, 13023, 12008"},{"$f":"_xlfn.TEXTJOIN(\" | \", TRUE,\n  _xlfn.MAP(TRIM(_xlfn.TEXTSPLIT(D56, \",\")),\n    _xlfn.LAMBDA(_xlpm.id,\n      _xlpm.id & \": \" &\n      SUMPRODUCT(\n        (LEN(\",\" & SUBSTITUTE($D$2:$D$500,\" \",\"\") & \",\")\n         - LEN(SUBSTITUTE(\",\" & SUBSTITUTE($D$2:$D$500,\" \",\"\") & \",\", \",\" & _xlpm.id & \",\", \"\")))\n        / LEN(\",\" & _xlpm.id & \",\")\n      )\n    )\n  )\n)","v":"13004: 5 | 13005: 5 | 12010: 5 | 13007: 5 | 13023: 5 | 12008: 5"},null,null,null,null,"고블린 라이더2",12006,"Melee",null,null,10019,"레드드래곤3"]
["스테이지 9-4",null,"타락한 기사2, 광전사5, 싸이클롭스3, 해골 궁수, 머미2, 사악한 악령2, 광전사3",{"$f":"_xlfn.TEXTJOIN(\", \", TRUE,\n    _xlfn.MAP(TRIM(_xlfn.TEXTSPLIT(C57, \",\")),\n        _xlfn.LAMBDA(_xlpm.n,\n            _xlfn.LET(\n                _xlpm.result, _xlfn.XLOOKUP(_xlpm.n, J:J, K:K, \"\"),\n                IF(_xlpm.result = \"\", _xlpm.n, _xlpm.result)\n            )\n        )\n    )\n)","v":"13026, 12012, 11026, 13028, 13008, 13015, 12010"},{"$f":"_xlfn.TEXTJOIN(\" | \", TRUE,\n  _xlfn.MAP(TRIM(_xlfn.TEXTSPLIT(D57, \",\")),\n    _xlfn.LAMBDA(_xlpm.id,\n      _xlpm.id & \": \" &\n      SUMPRODUCT(\n        (LEN(\",\" & SUBSTITUTE($D$2:$D$500,\" \",\"\") & \",\")\n         - LEN(SUBSTITUTE(\",\" & SUBSTITUTE($D$2:$D$500,\" \",\"\") & \",\", \",\" & _xlpm.id & \",\", \"\")))\n        / LEN(\",\" & _xlpm.id & \",\")\n      )\n    )\n  )\n)","v":"13026: 5 | 12012: 5 | 11026: 3 | 13028: 5 | 13008: 5 | 13015: 5 | 12010: 5"},"트롤 워리어4",10015,null,null,"고블린 아처1",12007,"Range",null,null,10020,"메두사2",6]
["스테이지 9-5",null,"싸이클롭스3, 악마 광신자4, 광전사1, 광전사3, 광전사5, 데스2",{"$f":"_xlfn.TEXTJOIN(\", \", TRUE,\n    _xlfn.MAP(TRIM(_xlfn.TEXTSPLIT(C58, \",\")),\n        _xlfn.LAMBDA(_xlpm.n,\n            _xlfn.LET(\n                _xlpm.result, _xlfn.XLOOKUP(_xlpm.n, J:J, K:K, \"\"),\n                IF(_xlpm.result = \"\", _xlpm.n, _xlpm.result)\n            )\n        )\n    )\n)","v":"11026, 13019, 12008, 12010, 12012, 13005"},{"$f":"_xlfn.TEXTJOIN(\" | \", TRUE,\n  _xlfn.MAP(TRIM(_xlfn.TEXTSPLIT(D58, \",\")),\n    _xlfn.LAMBDA(_xlpm.id,\n      _xlpm.id & \": \" &\n      SUMPRODUCT(\n        (LEN(\",\" & SUBSTITUTE($D$2:$D$500,\" \",\"\") & \",\")\n         - LEN(SUBSTITUTE(\",\" & SUBSTITUTE($D$2:$D$500,\" \",\"\") & \",\", \",\" & _xlpm.id & \",\", \"\")))\n        / LEN(\",\" & _xlpm.id & \",\")\n      )\n    )\n  )\n)","v":"11026: 3 | 13019: 5 | 12008: 5 | 12010: 5 | 12012: 5 | 13005: 5"},null,null,null,4,"네크로멘서1",13001,"Range",null,null,10021,"흑기사1"]
["스테이지 9-6",null,"싸이클롭스3, 해골 기사1, 해골 법사, 타락한 기사2, 네크로멘서1, 광전사5, 데스1",{"$f":"_xlfn.TEXTJOIN(\", \", TRUE,\n    _xlfn.MAP(TRIM(_xlfn.TEXTSPLIT(C59, \",\")),\n        _xlfn.LAMBDA(_xlpm.n,\n            _xlfn.LET(\n                _xlpm.result, _xlfn.XLOOKUP(_xlpm.n, J:J, K:K, \"\"),\n                IF(_xlpm.result = \"\", _xlpm.n, _xlpm.result)\n            )\n        )\n    )\n)","v":"11026, 13031, 13030, 13026, 13001, 12012, 13004"},{"$f":"_xlfn.TEXTJOIN(\" | \", TRUE,\n  _xlfn.MAP(TRIM(_xlfn.TEXTSPLIT(D59, \",\")),\n    _xlfn.LAMBDA(_xlpm.id,\n      _xlpm.id & \": \" &\n      SUMPRODUCT(\n        (LEN(\",\" & SUBSTITUTE($D$2:$D$500,\" \",\"\") & \",\")\n         - LEN(SUBSTITUTE(\",\" & SUBSTITUTE($D$2:$D$500,\" \",\"\") & \",\", \",\" & _xlpm.id & \",\", \"\")))\n        / LEN(\",\" & _xlpm.id & \",\")\n      )\n    )\n  )\n)","v":"11026: 3 | 13031: 5 | 13030: 6 | 13026: 5 | 13001: 5 | 12012: 5 | 13004: 5"},"트롤 워리어4",10015,null,null,"데스1",13004,"Melee",null,null,10022,"용암골렘2"]
[null,null,null,null,null,null,null,null,null,"머미1",13007,"Melee",null,null,10023,"레드드래곤1",7]
["스테이지 10-1","⑤ 임프 서식지","임프1, 임프3, 임프 마법사4, 다이어울프1, 임프1",{"$f":"_xlfn.TEXTJOIN(\", \", TRUE,\n    _xlfn.MAP(TRIM(_xlfn.TEXTSPLIT(C61, \",\")),\n        _xlfn.LAMBDA(_xlpm.n,\n            _xlfn.LET(\n                _xlpm.result, _xlfn.XLOOKUP(_xlpm.n, J:J, K:K, \"\"),\n                IF(_xlpm.result = \"\", _xlpm.n, _xlpm.result)\n            )\n        )\n    )\n)","v":"14023, 14025, 14030, 14010, 14023"},{"$f":"_xlfn.TEXTJOIN(\" | \", TRUE,\n  _xlfn.MAP(TRIM(_xlfn.TEXTSPLIT(D61, \",\")),\n    _xlfn.LAMBDA(_xlpm.id,\n      _xlpm.id & \": \" &\n      SUMPRODUCT(\n        (LEN(\",\" & SUBSTITUTE($D$2:$D$500,\" \",\"\") & \",\")\n         - LEN(SUBSTITUTE(\",\" & SUBSTITUTE($D$2:$D$500,\" \",\"\") & \",\", \",\" & _xlpm.id & \",\", \"\")))\n        / LEN(\",\" & _xlpm.id & \",\")\n      )\n    )\n  )\n)","v":"14023: 5 | 14025: 5 | 14030: 5 | 14010: 5 | 14023: 5"},null,null,null,null,"사악한 악령2",13015,"Melee",null,null,10024,"바포메트7"]
["스테이지 10-2",null,"구울1, 다이어울프1, 다이어울프2, 임프 마법사3, 임프1",{"$f":"_xlfn.TEXTJOIN(\", \", TRUE,\n    _xlfn.MAP(TRIM(_xlfn.TEXTSPLIT(C62, \",\")),\n        _xlfn.LAMBDA(_xlpm.n,\n            _xlfn.LET(\n                _xlpm.result, _xlfn.XLOOKUP(_xlpm.n, J:J, K:K, \"\"),\n                IF(_xlpm.result = \"\", _xlpm.n, _xlpm.result)\n            )\n        )\n    )\n)","v":"14007, 14010, 14011, 14029, 14023"},{"$f":"_xlfn.TEXTJOIN(\" | \", TRUE,\n  _xlfn.MAP(TRIM(_xlfn.TEXTSPLIT(D62, \",\")),\n    _xlfn.LAMBDA(_xlpm.id,\n      _xlpm.id & \": \" &\n      SUMPRODUCT(\n        (LEN(\",\" & SUBSTITUTE($D$2:$D$500,\" \",\"\") & \",\")\n         - LEN(SUBSTITUTE(\",\" & SUBSTITUTE($D$2:$D$500,\" \",\"\") & \",\", \",\" & _xlpm.id & \",\", \"\")))\n        / LEN(\",\" & _xlpm.id & \",\")\n      )\n    )\n  )\n)","v":"14007: 5 | 14010: 5 | 14011: 5 | 14029: 5 | 14023: 5"},null,null,null,null,"임프 사역마1",13023,"Melee",null,null,10025,"거미여왕1"]
["스테이지 10-3",null,"다이어울프2, 임프 사역마2, 임프 마법사3, 임프 전사2, 구울1",{"$f":"_xlfn.TEXTJOIN(\", \", TRUE,\n    _xlfn.MAP(TRIM(_xlfn.TEXTSPLIT(C63, \",\")),\n        _xlfn.LAMBDA(_xlpm.n,\n            _xlfn.LET(\n                _xlpm.result, _xlfn.XLOOKUP(_xlpm.n, J:J, K:K, \"\"),\n                IF(_xlpm.result = \"\", _xlpm.n, _xlpm.result)\n            )\n        )\n    )\n)","v":"14011, 13024, 14029, 14031, 14007"},{"$f":"_xlfn.TEXTJOIN(\" | \", TRUE,\n  _xlfn.MAP(TRIM(_xlfn.TEXTSPLIT(D63, \",\")),\n    _xlfn.LAMBDA(_xlpm.id,\n      _xlpm.id & \": \" &\n      SUMPRODUCT(\n        (LEN(\",\" & SUBSTITUTE($D$2:$D$500,\" \",\"\") & \",\")\n         - LEN(SUBSTITUTE(\",\" & SUBSTITUTE($D$2:$D$500,\" \",\"\") & \",\", \",\" & _xlpm.id & \",\", \"\")))\n        / LEN(\",\" & _xlpm.id & \",\")\n      )\n    )\n  )\n)","v":"14011: 5 | 13024: 5 | 14029: 5 | 14031: 5 | 14007: 5"},"흑기사3",10016,null,null,"네크로멘서2",13002,"Range",null,null,10026,"데스나이트1",8]
["스테이지 10-4",null,"다이어울프2, 임프1, 임프 사역마2, 구울2, 임프 전사3, 임프 전사2",{"$f":"_xlfn.TEXTJOIN(\", \", TRUE,\n    _xlfn.MAP(TRIM(_xlfn.TEXTSPLIT(C64, \",\")),\n        _xlfn.LAMBDA(_xlpm.n,\n            _xlfn.LET(\n                _xlpm.result, _xlfn.XLOOKUP(_xlpm.n, J:J, K:K, \"\"),\n                IF(_xlpm.result = \"\", _xlpm.n, _xlpm.result)\n            )\n        )\n    )\n)","v":"14011, 14023, 13024, 14008, 14032, 14031"},{"$f":"_xlfn.TEXTJOIN(\" | \", TRUE,\n  _xlfn.MAP(TRIM(_xlfn.TEXTSPLIT(D64, \",\")),\n    _xlfn.LAMBDA(_xlpm.id,\n      _xlpm.id & \": \" &\n      SUMPRODUCT(\n        (LEN(\",\" & SUBSTITUTE($D$2:$D$500,\" \",\"\") & \",\")\n         - LEN(SUBSTITUTE(\",\" & SUBSTITUTE($D$2:$D$500,\" \",\"\") & \",\", \",\" & _xlpm.id & \",\", \"\")))\n        / LEN(\",\" & _xlpm.id & \",\")\n      )\n    )\n  )\n)","v":"14011: 5 | 14023: 5 | 13024: 5 | 14008: 5 | 14032: 5 | 14031: 5"},null,null,null,null,"데스2",13005,"Melee",null,null,10027,"레드드래곤4"]
["스테이지 10-5",null,"다이어울프2, 임프 전사3, 임프 마법사3, 임프 마법사4, 임프 전사2, 임프3",{"$f":"_xlfn.TEXTJOIN(\", \", TRUE,\n    _xlfn.MAP(TRIM(_xlfn.TEXTSPLIT(C65, \",\")),\n        _xlfn.LAMBDA(_xlpm.n,\n            _xlfn.LET(\n                _xlpm.result, _xlfn.XLOOKUP(_xlpm.n, J:J, K:K, \"\"),\n                IF(_xlpm.result = \"\", _xlpm.n, _xlpm.result)\n            )\n        )\n    )\n)","v":"14011, 14032, 14029, 14030, 14031, 14025"},{"$f":"_xlfn.TEXTJOIN(\" | \", TRUE,\n  _xlfn.MAP(TRIM(_xlfn.TEXTSPLIT(D65, \",\")),\n    _xlfn.LAMBDA(_xlpm.id,\n      _xlpm.id & \": \" &\n      SUMPRODUCT(\n        (LEN(\",\" & SUBSTITUTE($D$2:$D$500,\" \",\"\") & \",\")\n         - LEN(SUBSTITUTE(\",\" & SUBSTITUTE($D$2:$D$500,\" \",\"\") & \",\", \",\" & _xlpm.id & \",\", \"\")))\n        / LEN(\",\" & _xlpm.id & \",\")\n      )\n    )\n  )\n)","v":"14011: 5 | 14032: 5 | 14029: 5 | 14030: 5 | 14031: 5 | 14025: 5"},"흑기사3",10016,null,null,"머미2",13008,"Melee",null,null,10028,"타락한 천사"]
[null,null,null,null,null,null,null,null,null,"타락한 기사2",13026,"Melee"]
["스테이지 11-1","⑤ 악마의 소굴","구울1, 구울2, 구울3, 임프3, 살인 청부업자1, 임프 마법사4",{"$f":"_xlfn.TEXTJOIN(\", \", TRUE,\n    _xlfn.MAP(TRIM(_xlfn.TEXTSPLIT(C67, \",\")),\n        _xlfn.LAMBDA(_xlpm.n,\n            _xlfn.LET(\n                _xlpm.result, _xlfn.XLOOKUP(_xlpm.n, J:J, K:K, \"\"),\n                IF(_xlpm.result = \"\", _xlpm.n, _xlpm.result)\n            )\n        )\n    )\n)","v":"14007, 14008, 14009, 14025, 12022, 14030"},{"$f":"_xlfn.TEXTJOIN(\" | \", TRUE,\n  _xlfn.MAP(TRIM(_xlfn.TEXTSPLIT(D67, \",\")),\n    _xlfn.LAMBDA(_xlpm.id,\n      _xlpm.id & \": \" &\n      SUMPRODUCT(\n        (LEN(\",\" & SUBSTITUTE($D$2:$D$500,\" \",\"\") & \",\")\n         - LEN(SUBSTITUTE(\",\" & SUBSTITUTE($D$2:$D$500,\" \",\"\") & \",\", \",\" & _xlpm.id & \",\", \"\")))\n        / LEN(\",\" & _xlpm.id & \",\")\n      )\n    )\n  )\n)","v":"14007: 5 | 14008: 5 | 14009: 5 | 14025: 5 | 12022: 6 | 14030: 5"},null,null,null,null,"광전사1",12008,"Melee"]
["스테이지 11-2",null,"구울2, 도살자1, 살인 청부업자1, 임프3, 임프 사역마2, 다이어울프1",{"$f":"_xlfn.TEXTJOIN(\", \", TRUE,\n    _xlfn.MAP(TRIM(_xlfn.TEXTSPLIT(C68, \",\")),\n        _xlfn.LAMBDA(_xlpm.n,\n            _xlfn.LET(\n                _xlpm.result, _xlfn.XLOOKUP(_xlpm.n, J:J, K:K, \"\"),\n                IF(_xlpm.result = \"\", _xlpm.n, _xlpm.result)\n            )\n        )\n    )\n)","v":"14008, 12020, 12022, 14025, 13024, 14010"},{"$f":"_xlfn.TEXTJOIN(\" | \", TRUE,\n  _xlfn.MAP(TRIM(_xlfn.TEXTSPLIT(D68, \",\")),\n    _xlfn.LAMBDA(_xlpm.id,\n      _xlpm.id & \": \" &\n      SUMPRODUCT(\n        (LEN(\",\" & SUBSTITUTE($D$2:$D$500,\" \",\"\") & \",\")\n         - LEN(SUBSTITUTE(\",\" & SUBSTITUTE($D$2:$D$500,\" \",\"\") & \",\", \",\" & _xlpm.id & \",\", \"\")))\n        / LEN(\",\" & _xlpm.id & \",\")\n      )\n    )\n  )\n)","v":"14008: 5 | 12020: 5 | 12022: 6 | 14025: 5 | 13024: 5 | 14010: 5"},"흡혈귀여왕2",10017,null,null,"광전사3",12010,"Melee"]
["스테이지 11-3",null,"임프 사역마2, 흡혈귀1, 임프 전사3, 살인 청부업자1, 도살자2, 임프 마법사3",{"$f":"_xlfn.TEXTJOIN(\", \", TRUE,\n    _xlfn.MAP(TRIM(_xlfn.TEXTSPLIT(C69, \",\")),\n        _xlfn.LAMBDA(_xlpm.n,\n            _xlfn.LET(\n                _xlpm.result, _xlfn.XLOOKUP(_xlpm.n, J:J, K:K, \"\"),\n                IF(_xlpm.result = \"\", _xlpm.n, _xlpm.result)\n            )\n        )\n    )\n)","v":"13024, 14034, 14032, 12022, 12021, 14029"},{"$f":"_xlfn.TEXTJOIN(\" | \", TRUE,\n  _xlfn.MAP(TRIM(_xlfn.TEXTSPLIT(D69, \",\")),\n    _xlfn.LAMBDA(_xlpm.id,\n      _xlpm.id & \": \" &\n      SUMPRODUCT(\n        (LEN(\",\" & SUBSTITUTE($D$2:$D$500,\" \",\"\") & \",\")\n         - LEN(SUBSTITUTE(\",\" & SUBSTITUTE($D$2:$D$500,\" \",\"\") & \",\", \",\" & _xlpm.id & \",\", \"\")))\n        / LEN(\",\" & _xlpm.id & \",\")\n      )\n    )\n  )\n)","v":"13024: 5 | 14034: 5 | 14032: 5 | 12022: 6 | 12021: 5 | 14029: 5"},null,null,null,null,"광전사5",12012,"Melee"]
["스테이지 11-4",null,"임프 전사3, 살인 청부업자1, 도살자2, 임프 마법사4, 다이어울프1",{"$f":"_xlfn.TEXTJOIN(\", \", TRUE,\n    _xlfn.MAP(TRIM(_xlfn.TEXTSPLIT(C70, \",\")),\n        _xlfn.LAMBDA(_xlpm.n,\n            _xlfn.LET(\n                _xlpm.result, _xlfn.XLOOKUP(_xlpm.n, J:J, K:K, \"\"),\n                IF(_xlpm.result = \"\", _xlpm.n, _xlpm.result)\n            )\n        )\n    )\n)","v":"14032, 12022, 12021, 14030, 14010"},{"$f":"_xlfn.TEXTJOIN(\" | \", TRUE,\n  _xlfn.MAP(TRIM(_xlfn.TEXTSPLIT(D70, \",\")),\n    _xlfn.LAMBDA(_xlpm.id,\n      _xlpm.id & \": \" &\n      SUMPRODUCT(\n        (LEN(\",\" & SUBSTITUTE($D$2:$D$500,\" \",\"\") & \",\")\n         - LEN(SUBSTITUTE(\",\" & SUBSTITUTE($D$2:$D$500,\" \",\"\") & \",\", \",\" & _xlpm.id & \",\", \"\")))\n        / LEN(\",\" & _xlpm.id & \",\")\n      )\n    )\n  )\n)","v":"14032: 5 | 12022: 6 | 12021: 5 | 14030: 5 | 14010: 5"},"흑기사3",10016,null,null,"네크로멘서3",13003,"Range"]
["스테이지 11-5",null,"임프 전사2, 흡혈귀1, 다크엘프 마법사4, 임프1, 임프3, 타락한 기사1",{"$f":"_xlfn.TEXTJOIN(\", \", TRUE,\n    _xlfn.MAP(TRIM(_xlfn.TEXTSPLIT(C71, \",\")),\n        _xlfn.LAMBDA(_xlpm.n,\n            _xlfn.LET(\n                _xlpm.result, _xlfn.XLOOKUP(_xlpm.n, J:J, K:K, \"\"),\n                IF(_xlpm.result = \"\", _xlpm.n, _xlpm.result)\n            )\n        )\n    )\n)","v":"14031, 14034, 12019, 14023, 14025, 13025"},{"$f":"_xlfn.TEXTJOIN(\" | \", TRUE,\n  _xlfn.MAP(TRIM(_xlfn.TEXTSPLIT(D71, \",\")),\n    _xlfn.LAMBDA(_xlpm.id,\n      _xlpm.id & \": \" &\n      SUMPRODUCT(\n        (LEN(\",\" & SUBSTITUTE($D$2:$D$500,\" \",\"\") & \",\")\n         - LEN(SUBSTITUTE(\",\" & SUBSTITUTE($D$2:$D$500,\" \",\"\") & \",\", \",\" & _xlpm.id & \",\", \"\")))\n        / LEN(\",\" & _xlpm.id & \",\")\n      )\n    )\n  )\n)","v":"14031: 5 | 14034: 5 | 12019: 5 | 14023: 5 | 14025: 5 | 13025: 5"},"흡혈귀여왕2",10017,null,null,"악마 광신자4",13019,"Range"]
[null,null,null,null,null,null,null,null,null,"싸이클롭스3",11026,"Range"]
["스테이지 12-1","⑤ 피의 성채","예티1, 다크엘프 마법사4, 흡혈귀1, 도살자1, 다이어울프1, 다이어울프2",{"$f":"_xlfn.TEXTJOIN(\", \", TRUE,\n    _xlfn.MAP(TRIM(_xlfn.TEXTSPLIT(C73, \",\")),\n        _xlfn.LAMBDA(_xlpm.n,\n            _xlfn.LET(\n                _xlpm.result, _xlfn.XLOOKUP(_xlpm.n, J:J, K:K, \"\"),\n                IF(_xlpm.result = \"\", _xlpm.n, _xlpm.result)\n            )\n        )\n    )\n)","v":"11027, 12019, 14034, 12020, 14010, 14011"},{"$f":"_xlfn.TEXTJOIN(\" | \", TRUE,\n  _xlfn.MAP(TRIM(_xlfn.TEXTSPLIT(D73, \",\")),\n    _xlfn.LAMBDA(_xlpm.id,\n      _xlpm.id & \": \" &\n      SUMPRODUCT(\n        (LEN(\",\" & SUBSTITUTE($D$2:$D$500,\" \",\"\") & \",\")\n         - LEN(SUBSTITUTE(\",\" & SUBSTITUTE($D$2:$D$500,\" \",\"\") & \",\", \",\" & _xlpm.id & \",\", \"\")))\n        / LEN(\",\" & _xlpm.id & \",\")\n      )\n    )\n  )\n)","v":"11027: 5 | 12019: 5 | 14034: 5 | 12020: 5 | 14010: 5 | 14011: 5"},"에티4",10018,null,null,"해골 궁수",13028,"Range"]
["스테이지 12-2",null,"구울1, 구울2, 구울3, 다크엘프 마법사4, 임프 전사3, 도살자2, 타락한 기사1",{"$f":"_xlfn.TEXTJOIN(\", \", TRUE,\n    _xlfn.MAP(TRIM(_xlfn.TEXTSPLIT(C74, \",\")),\n        _xlfn.LAMBDA(_xlpm.n,\n            _xlfn.LET(\n                _xlpm.result, _xlfn.XLOOKUP(_xlpm.n, J:J, K:K, \"\"),\n                IF(_xlpm.result = \"\", _xlpm.n, _xlpm.result)\n            )\n        )\n    )\n)","v":"14007, 14008, 14009, 12019, 14032, 12021, 13025"},{"$f":"_xlfn.TEXTJOIN(\" | \", TRUE,\n  _xlfn.MAP(TRIM(_xlfn.TEXTSPLIT(D74, \",\")),\n    _xlfn.LAMBDA(_xlpm.id,\n      _xlpm.id & \": \" &\n      SUMPRODUCT(\n        (LEN(\",\" & SUBSTITUTE($D$2:$D$500,\" \",\"\") & \",\")\n         - LEN(SUBSTITUTE(\",\" & SUBSTITUTE($D$2:$D$500,\" \",\"\") & \",\", \",\" & _xlpm.id & \",\", \"\")))\n        / LEN(\",\" & _xlpm.id & \",\")\n      )\n    )\n  )\n)","v":"14007: 5 | 14008: 5 | 14009: 5 | 12019: 5 | 14032: 5 | 12021: 5 | 13025: 5"},"흡혈귀여왕2",10017,null,null,"해골 근위병",13029,"Melee"]
["스테이지 12-3",null,"흡혈귀1, 예티1, 예티2, 임프 전사2, 도살자1, 살인 청부업자2, 살인 청부업자1",{"$f":"_xlfn.TEXTJOIN(\", \", TRUE,\n    _xlfn.MAP(TRIM(_xlfn.TEXTSPLIT(C75, \",\")),\n        _xlfn.LAMBDA(_xlpm.n,\n            _xlfn.LET(\n                _xlpm.result, _xlfn.XLOOKUP(_xlpm.n, J:J, K:K, \"\"),\n                IF(_xlpm.result = \"\", _xlpm.n, _xlpm.result)\n            )\n        )\n    )\n)","v":"14034, 11027, 11028, 14031, 12020, 12023, 12022"},{"$f":"_xlfn.TEXTJOIN(\" | \", TRUE,\n  _xlfn.MAP(TRIM(_xlfn.TEXTSPLIT(D75, \",\")),\n    _xlfn.LAMBDA(_xlpm.id,\n      _xlpm.id & \": \" &\n      SUMPRODUCT(\n        (LEN(\",\" & SUBSTITUTE($D$2:$D$500,\" \",\"\") & \",\")\n         - LEN(SUBSTITUTE(\",\" & SUBSTITUTE($D$2:$D$500,\" \",\"\") & \",\", \",\" & _xlpm.id & \",\", \"\")))\n        / LEN(\",\" & _xlpm.id & \",\")\n      )\n    )\n  )\n)","v":"14034: 5 | 11027: 5 | 11028: 5 | 14031: 5 | 12020: 5 | 12023: 6 | 12022: 6"},"흑기사3",10016,null,null,"해골 기사1",13031,"Melee"]
["스테이지 12-4",null,"타락한 기사1, 구울3, 예티2, 임프 사역마2, 도살자2, 도살자1",{"$f":"_xlfn.TEXTJOIN(\", \", TRUE,\n    _xlfn.MAP(TRIM(_xlfn.TEXTSPLIT(C76, \",\")),\n        _xlfn.LAMBDA(_xlpm.n,\n            _xlfn.LET(\n                _xlpm.result, _xlfn.XLOOKUP(_xlpm.n, J:J, K:K, \"\"),\n                IF(_xlpm.result = \"\", _xlpm.n, _xlpm.result)\n            )\n        )\n    )\n)","v":"13025, 14009, 11028, 13024, 12021, 12020"},{"$f":"_xlfn.TEXTJOIN(\" | \", TRUE,\n  _xlfn.MAP(TRIM(_xlfn.TEXTSPLIT(D76, \",\")),\n    _xlfn.LAMBDA(_xlpm.id,\n      _xlpm.id & \": \" &\n      SUMPRODUCT(\n        (LEN(\",\" & SUBSTITUTE($D$2:$D$500,\" \",\"\") & \",\")\n         - LEN(SUBSTITUTE(\",\" & SUBSTITUTE($D$2:$D$500,\" \",\"\") & \",\", \",\" & _xlpm.id & \",\", \"\")))\n        / LEN(\",\" & _xlpm.id & \",\")\n      )\n    )\n  )\n)","v":"13025: 5 | 14009: 5 | 11028: 5 | 13024: 5 | 12021: 5 | 12020: 5"},null,null,null,null,"해골 기사1",13031,"Range"]
["스테이지 12-5",null,"예티1, 예티2, 타락한 기사1, 구울3, 다크엘프 마법사4, 도살자1, 도살자2",{"$f":"_xlfn.TEXTJOIN(\", \", TRUE,\n    _xlfn.MAP(TRIM(_xlfn.TEXTSPLIT(C77, \",\")),\n        _xlfn.LAMBDA(_xlpm.n,\n            _xlfn.LET(\n                _xlpm.result, _xlfn.XLOOKUP(_xlpm.n, J:J, K:K, \"\"),\n                IF(_xlpm.result = \"\", _xlpm.n, _xlpm.result)\n            )\n        )\n    )\n)","v":"11027, 11028, 13025, 14009, 12019, 12020, 12021"},{"$f":"_xlfn.TEXTJOIN(\" | \", TRUE,\n  _xlfn.MAP(TRIM(_xlfn.TEXTSPLIT(D77, \",\")),\n    _xlfn.LAMBDA(_xlpm.id,\n      _xlpm.id & \": \" &\n      SUMPRODUCT(\n        (LEN(\",\" & SUBSTITUTE($D$2:$D$500,\" \",\"\") & \",\")\n         - LEN(SUBSTITUTE(\",\" & SUBSTITUTE($D$2:$D$500,\" \",\"\") & \",\", \",\" & _xlpm.id & \",\", \"\")))\n        / LEN(\",\" & _xlpm.id & \",\")\n      )\n    )\n  )\n)","v":"11027: 5 | 11028: 5 | 13025: 5 | 14009: 5 | 12019: 5 | 12020: 5 | 12021: 5"},"에티4",10018,null,5,"예티1",11027,"Melee"]
["스테이지 12-6",null,"예티1, 예티2, 임프 마법사3, 흡혈귀1, 타락한 기사1, 구울2, 살인 청부업자2",{"$f":"_xlfn.TEXTJOIN(\", \", TRUE,\n    _xlfn.MAP(TRIM(_xlfn.TEXTSPLIT(C78, \",\")),\n        _xlfn.LAMBDA(_xlpm.n,\n            _xlfn.LET(\n                _xlpm.result, _xlfn.XLOOKUP(_xlpm.n, J:J, K:K, \"\"),\n                IF(_xlpm.result = \"\", _xlpm.n, _xlpm.result)\n            )\n        )\n    )\n)","v":"11027, 11028, 14029, 14034, 13025, 14008, 12023"},{"$f":"_xlfn.TEXTJOIN(\" | \", TRUE,\n  _xlfn.MAP(TRIM(_xlfn.TEXTSPLIT(D78, \",\")),\n    _xlfn.LAMBDA(_xlpm.id,\n      _xlpm.id & \": \" &\n      SUMPRODUCT(\n        (LEN(\",\" & SUBSTITUTE($D$2:$D$500,\" \",\"\") & \",\")\n         - LEN(SUBSTITUTE(\",\" & SUBSTITUTE($D$2:$D$500,\" \",\"\") & \",\", \",\" & _xlpm.id & \",\", \"\")))\n        / LEN(\",\" & _xlpm.id & \",\")\n      )\n    )\n  )\n)","v":"11027: 5 | 11028: 5 | 14029: 5 | 14034: 5 | 13025: 5 | 14008: 5 | 12023: 6"},"흡혈귀여왕2",10017,null,null,"예티2",11028,"Melee"]
["스테이지 12-7",null,"예티1, 예티2, 임프 마법사4, 구울3, 다크엘프 마법사4, 구울1, 살인 청부업자1",{"$f":"_xlfn.TEXTJOIN(\", \", TRUE,\n    _xlfn.MAP(TRIM(_xlfn.TEXTSPLIT(C79, \",\")),\n        _xlfn.LAMBDA(_xlpm.n,\n            _xlfn.LET(\n                _xlpm.result, _xlfn.XLOOKUP(_xlpm.n, J:J, K:K, \"\"),\n                IF(_xlpm.result = \"\", _xlpm.n, _xlpm.result)\n            )\n        )\n    )\n)","v":"11027, 11028, 14030, 14009, 12019, 14007, 12022"},{"$f":"_xlfn.TEXTJOIN(\" | \", TRUE,\n  _xlfn.MAP(TRIM(_xlfn.TEXTSPLIT(D79, \",\")),\n    _xlfn.LAMBDA(_xlpm.id,\n      _xlpm.id & \": \" &\n      SUMPRODUCT(\n        (LEN(\",\" & SUBSTITUTE($D$2:$D$500,\" \",\"\") & \",\")\n         - LEN(SUBSTITUTE(\",\" & SUBSTITUTE($D$2:$D$500,\" \",\"\") & \",\", \",\" & _xlpm.id & \",\", \"\")))\n        / LEN(\",\" & _xlpm.id & \",\")\n      )\n    )\n  )\n)","v":"11027: 5 | 11028: 5 | 14030: 5 | 14009: 5 | 12019: 5 | 14007: 5 | 12022: 6"},"에티4",10018,null,null,"다크엘프 마법사4",12019,"Range"]
[null,null,null,null,null,null,null,null,null,"도살자1",12020,"Melee"]
["스테이지 13-1","⑥ 드래곤 서식처","강도1, 강도2, 강도3, 활든 강도1, 악마 광신자3, 연쇄살인마1, 무리안",{"$f":"_xlfn.TEXTJOIN(\", \", TRUE,\n    _xlfn.MAP(TRIM(_xlfn.TEXTSPLIT(C81, \",\")),\n        _xlfn.LAMBDA(_xlpm.n,\n            _xlfn.LET(\n                _xlpm.result, _xlfn.XLOOKUP(_xlpm.n, J:J, K:K, \"\"),\n                IF(_xlpm.result = \"\", _xlpm.n, _xlpm.result)\n            )\n        )\n    )\n)","v":"12001, 12002, 12003, 12035, 13018, 12025, 14005"},{"$f":"_xlfn.TEXTJOIN(\" | \", TRUE,\n  _xlfn.MAP(TRIM(_xlfn.TEXTSPLIT(D81, \",\")),\n    _xlfn.LAMBDA(_xlpm.id,\n      _xlpm.id & \": \" &\n      SUMPRODUCT(\n        (LEN(\",\" & SUBSTITUTE($D$2:$D$500,\" \",\"\") & \",\")\n         - LEN(SUBSTITUTE(\",\" & SUBSTITUTE($D$2:$D$500,\" \",\"\") & \",\", \",\" & _xlpm.id & \",\", \"\")))\n        / LEN(\",\" & _xlpm.id & \",\")\n      )\n    )\n  )\n)","v":"12001: 6 | 12002: 6 | 12003: 6 | 12035: 6 | 13018: 5 | 12025: 6 | 14005: 6"},null,null,null,null,"임프 사역마2",13024,"Melee"]
["스테이지 13-2",null,"강도1, 활든 강도1, 악마 광신자3, 연쇄살인마1, 연쇄살인마2, 악마 광신자3, 강도3",{"$f":"_xlfn.TEXTJOIN(\", \", TRUE,\n    _xlfn.MAP(TRIM(_xlfn.TEXTSPLIT(C82, \",\")),\n        _xlfn.LAMBDA(_xlpm.n,\n            _xlfn.LET(\n                _xlpm.result, _xlfn.XLOOKUP(_xlpm.n, J:J, K:K, \"\"),\n                IF(_xlpm.result = \"\", _xlpm.n, _xlpm.result)\n            )\n        )\n    )\n)","v":"12001, 12035, 13018, 12025, 12026, 13018, 12003"},{"$f":"_xlfn.TEXTJOIN(\" | \", TRUE,\n  _xlfn.MAP(TRIM(_xlfn.TEXTSPLIT(D82, \",\")),\n    _xlfn.LAMBDA(_xlpm.id,\n      _xlpm.id & \": \" &\n      SUMPRODUCT(\n        (LEN(\",\" & SUBSTITUTE($D$2:$D$500,\" \",\"\") & \",\")\n         - LEN(SUBSTITUTE(\",\" & SUBSTITUTE($D$2:$D$500,\" \",\"\") & \",\", \",\" & _xlpm.id & \",\", \"\")))\n        / LEN(\",\" & _xlpm.id & \",\")\n      )\n    )\n  )\n)","v":"12001: 6 | 12035: 6 | 13018: 5 | 12025: 6 | 12026: 6 | 13018: 5 | 12003: 6"},null,null,null,null,"도살자2",12021,"Melee"]
["스테이지 13-3",null,"강도2, 강도3, 광전사2, 악마 광신자3, 활든 강도1, 활든 강도2, 연쇄살인마2",{"$f":"_xlfn.TEXTJOIN(\", \", TRUE,\n    _xlfn.MAP(TRIM(_xlfn.TEXTSPLIT(C83, \",\")),\n        _xlfn.LAMBDA(_xlpm.n,\n            _xlfn.LET(\n                _xlpm.result, _xlfn.XLOOKUP(_xlpm.n, J:J, K:K, \"\"),\n                IF(_xlpm.result = \"\", _xlpm.n, _xlpm.result)\n            )\n        )\n    )\n)","v":"12002, 12003, 12009, 13018, 12035, 12036, 12026"},{"$f":"_xlfn.TEXTJOIN(\" | \", TRUE,\n  _xlfn.MAP(TRIM(_xlfn.TEXTSPLIT(D83, \",\")),\n    _xlfn.LAMBDA(_xlpm.id,\n      _xlpm.id & \": \" &\n      SUMPRODUCT(\n        (LEN(\",\" & SUBSTITUTE($D$2:$D$500,\" \",\"\") & \",\")\n         - LEN(SUBSTITUTE(\",\" & SUBSTITUTE($D$2:$D$500,\" \",\"\") & \",\", \",\" & _xlpm.id & \",\", \"\")))\n        / LEN(\",\" & _xlpm.id & \",\")\n      )\n    )\n  )\n)","v":"12002: 6 | 12003: 6 | 12009: 6 | 13018: 5 | 12035: 6 | 12036: 6 | 12026: 6"},null,null,null,null,"살인 청부업자1",12022,"Melee"]
["스테이지 13-4",null,"악마 추종자1, 강도1, 강도2, 강도3, 광전사2, 활든 강도1, 활든 강도2",{"$f":"_xlfn.TEXTJOIN(\", \", TRUE,\n    _xlfn.MAP(TRIM(_xlfn.TEXTSPLIT(C84, \",\")),\n        _xlfn.LAMBDA(_xlpm.n,\n            _xlfn.LET(\n                _xlpm.result, _xlfn.XLOOKUP(_xlpm.n, J:J, K:K, \"\"),\n                IF(_xlpm.result = \"\", _xlpm.n, _xlpm.result)\n            )\n        )\n    )\n)","v":"13020, 12001, 12002, 12003, 12009, 12035, 12036"},{"$f":"_xlfn.TEXTJOIN(\" | \", TRUE,\n  _xlfn.MAP(TRIM(_xlfn.TEXTSPLIT(D84, \",\")),\n    _xlfn.LAMBDA(_xlpm.id,\n      _xlpm.id & \": \" &\n      SUMPRODUCT(\n        (LEN(\",\" & SUBSTITUTE($D$2:$D$500,\" \",\"\") & \",\")\n         - LEN(SUBSTITUTE(\",\" & SUBSTITUTE($D$2:$D$500,\" \",\"\") & \",\", \",\" & _xlpm.id & \",\", \"\")))\n        / LEN(\",\" & _xlpm.id & \",\")\n      )\n    )\n  )\n)","v":"13020: 6 | 12001: 6 | 12002: 6 | 12003: 6 | 12009: 6 | 12035: 6 | 12036: 6"},"레드드래곤3",10019,null,null,"타락한 기사1",13025,"Melee"]
[null,null,null,null,null,null,null,null,null,"구울1",14007,"Melee"]
["스테이지 14-1","⑥ 마녀의 은신처","오크 워리어1, 악마 광신자3, 악마 추종자1, 오크 워리어1, 광전사4, 활든 강도1, 연쇄살인마2",{"$f":"_xlfn.TEXTJOIN(\", \", TRUE,\n    _xlfn.MAP(TRIM(_xlfn.TEXTSPLIT(C86, \",\")),\n        _xlfn.LAMBDA(_xlpm.n,\n            _xlfn.LET(\n                _xlpm.result, _xlfn.XLOOKUP(_xlpm.n, J:J, K:K, \"\"),\n                IF(_xlpm.result = \"\", _xlpm.n, _xlpm.result)\n            )\n        )\n    )\n)","v":"12034, 13018, 13020, 12034, 12011, 12035, 12026"},{"$f":"_xlfn.TEXTJOIN(\" | \", TRUE,\n  _xlfn.MAP(TRIM(_xlfn.TEXTSPLIT(D86, \",\")),\n    _xlfn.LAMBDA(_xlpm.id,\n      _xlpm.id & \": \" &\n      SUMPRODUCT(\n        (LEN(\",\" & SUBSTITUTE($D$2:$D$500,\" \",\"\") & \",\")\n         - LEN(SUBSTITUTE(\",\" & SUBSTITUTE($D$2:$D$500,\" \",\"\") & \",\", \",\" & _xlpm.id & \",\", \"\")))\n        / LEN(\",\" & _xlpm.id & \",\")\n      )\n    )\n  )\n)","v":"12034: 5 | 13018: 5 | 13020: 6 | 12034: 5 | 12011: 5 | 12035: 6 | 12026: 6"},null,null,null,null,"구울2",14008,"Melee"]
["스테이지 14-2",null,"해골 법사, 해골 기사4, 해골 기사2, 데스나이트2, 광전사2, 강도1, 강도2",{"$f":"_xlfn.TEXTJOIN(\", \", TRUE,\n    _xlfn.MAP(TRIM(_xlfn.TEXTSPLIT(C87, \",\")),\n        _xlfn.LAMBDA(_xlpm.n,\n            _xlfn.LET(\n                _xlpm.result, _xlfn.XLOOKUP(_xlpm.n, J:J, K:K, \"\"),\n                IF(_xlpm.result = \"\", _xlpm.n, _xlpm.result)\n            )\n        )\n    )\n)","v":"13030, 13034, 13032, 13006, 12009, 12001, 12002"},{"$f":"_xlfn.TEXTJOIN(\" | \", TRUE,\n  _xlfn.MAP(TRIM(_xlfn.TEXTSPLIT(D87, \",\")),\n    _xlfn.LAMBDA(_xlpm.id,\n      _xlpm.id & \": \" &\n      SUMPRODUCT(\n        (LEN(\",\" & SUBSTITUTE($D$2:$D$500,\" \",\"\") & \",\")\n         - LEN(SUBSTITUTE(\",\" & SUBSTITUTE($D$2:$D$500,\" \",\"\") & \",\", \",\" & _xlpm.id & \",\", \"\")))\n        / LEN(\",\" & _xlpm.id & \",\")\n      )\n    )\n  )\n)","v":"13030: 6 | 13034: 6 | 13032: 6 | 13006: 5 | 12009: 6 | 12001: 6 | 12002: 6"},null,null,null,null,"구울3",14009,"Melee"]
["스테이지 14-3",null,"해골 법사, 해골 기사2, 오크 워리어1, 데스나이트2, 미노타우르스 챔피언1, 미노타우르스 챔피언2, 해골 기사3, 강도1",{"$f":"_xlfn.TEXTJOIN(\", \", TRUE,\n    _xlfn.MAP(TRIM(_xlfn.TEXTSPLIT(C88, \",\")),\n        _xlfn.LAMBDA(_xlpm.n,\n            _xlfn.LET(\n                _xlpm.result, _xlfn.XLOOKUP(_xlpm.n, J:J, K:K, \"\"),\n                IF(_xlpm.result = \"\", _xlpm.n, _xlpm.result)\n            )\n        )\n    )\n)","v":"13030, 13032, 12034, 13006, 11015, 11016, 13033, 12001"},{"$f":"_xlfn.TEXTJOIN(\" | \", TRUE,\n  _xlfn.MAP(TRIM(_xlfn.TEXTSPLIT(D88, \",\")),\n    _xlfn.LAMBDA(_xlpm.id,\n      _xlpm.id & \": \" &\n      SUMPRODUCT(\n        (LEN(\",\" & SUBSTITUTE($D$2:$D$500,\" \",\"\") & \",\")\n         - LEN(SUBSTITUTE(\",\" & SUBSTITUTE($D$2:$D$500,\" \",\"\") & \",\", \",\" & _xlpm.id & \",\", \"\")))\n        / LEN(\",\" & _xlpm.id & \",\")\n      )\n    )\n  )\n)","v":"13030: 6 | 13032: 6 | 12034: 5 | 13006: 5 | 11015: 6 | 11016: 5 | 13033: 6 | 12001: 6"},"레드드래곤3",10019,null,null,"다이어울프1",14010,"Melee"]
["스테이지 14-4",null,"해골 법사, 해골 기사3, 해골 기사4, 해골 기사2, 데스나이트2, 악마 추종자1, 무리안, 강도2",{"$f":"_xlfn.TEXTJOIN(\", \", TRUE,\n    _xlfn.MAP(TRIM(_xlfn.TEXTSPLIT(C89, \",\")),\n        _xlfn.LAMBDA(_xlpm.n,\n            _xlfn.LET(\n                _xlpm.result, _xlfn.XLOOKUP(_xlpm.n, J:J, K:K, \"\"),\n                IF(_xlpm.result = \"\", _xlpm.n, _xlpm.result)\n            )\n        )\n    )\n)","v":"13030, 13033, 13034, 13032, 13006, 13020, 14005, 12002"},{"$f":"_xlfn.TEXTJOIN(\" | \", TRUE,\n  _xlfn.MAP(TRIM(_xlfn.TEXTSPLIT(D89, \",\")),\n    _xlfn.LAMBDA(_xlpm.id,\n      _xlpm.id & \": \" &\n      SUMPRODUCT(\n        (LEN(\",\" & SUBSTITUTE($D$2:$D$500,\" \",\"\") & \",\")\n         - LEN(SUBSTITUTE(\",\" & SUBSTITUTE($D$2:$D$500,\" \",\"\") & \",\", \",\" & _xlpm.id & \",\", \"\")))\n        / LEN(\",\" & _xlpm.id & \",\")\n      )\n    )\n  )\n)","v":"13030: 6 | 13033: 6 | 13034: 6 | 13032: 6 | 13006: 5 | 13020: 6 | 14005: 6 | 12002: 6"},null,null,null,null,"다이어울프2",14011,"Melee"]
["스테이지 14-5",null,"해골 법사, 해골 기사3, 해골 기사4, 해골 기사2, 데스나이트2, 무리안, 광전사2, 악마 추종자1",{"$f":"_xlfn.TEXTJOIN(\", \", TRUE,\n    _xlfn.MAP(TRIM(_xlfn.TEXTSPLIT(C90, \",\")),\n        _xlfn.LAMBDA(_xlpm.n,\n            _xlfn.LET(\n                _xlpm.result, _xlfn.XLOOKUP(_xlpm.n, J:J, K:K, \"\"),\n                IF(_xlpm.result = \"\", _xlpm.n, _xlpm.result)\n            )\n        )\n    )\n)","v":"13030, 13033, 13034, 13032, 13006, 14005, 12009, 13020"},{"$f":"_xlfn.TEXTJOIN(\" | \", TRUE,\n  _xlfn.MAP(TRIM(_xlfn.TEXTSPLIT(D90, \",\")),\n    _xlfn.LAMBDA(_xlpm.id,\n      _xlpm.id & \": \" &\n      SUMPRODUCT(\n        (LEN(\",\" & SUBSTITUTE($D$2:$D$500,\" \",\"\") & \",\")\n         - LEN(SUBSTITUTE(\",\" & SUBSTITUTE($D$2:$D$500,\" \",\"\") & \",\", \",\" & _xlpm.id & \",\", \"\")))\n        / LEN(\",\" & _xlpm.id & \",\")\n      )\n    )\n  )\n)","v":"13030: 6 | 13033: 6 | 13034: 6 | 13032: 6 | 13006: 5 | 14005: 6 | 12009: 6 | 13020: 6"},"메두사2",10020,null,null,"임프 마법사3",14029,"Range"]
[null,null,null,null,null,null,null,null,null,"임프 전사3",14032,"Melee"]
["스테이지 15-1","⑥ 광신자의 탑"," 광전사2, 광전사4, 다크엘프 마법사3, 다크엘프 기사4, 미노타우르스 챔피언1, 광전사3, 버그베어1, 해골 기사4",{"$f":"_xlfn.TEXTJOIN(\", \", TRUE,\n    _xlfn.MAP(TRIM(_xlfn.TEXTSPLIT(C92, \",\")),\n        _xlfn.LAMBDA(_xlpm.n,\n            _xlfn.LET(\n                _xlpm.result, _xlfn.XLOOKUP(_xlpm.n, J:J, K:K, \"\"),\n                IF(_xlpm.result = \"\", _xlpm.n, _xlpm.result)\n            )\n        )\n    )\n)","v":"12009, 12011, 12018, 12016, 11015, 12010, 11020, 13034"},{"$f":"_xlfn.TEXTJOIN(\" | \", TRUE,\n  _xlfn.MAP(TRIM(_xlfn.TEXTSPLIT(D92, \",\")),\n    _xlfn.LAMBDA(_xlpm.id,\n      _xlpm.id & \": \" &\n      SUMPRODUCT(\n        (LEN(\",\" & SUBSTITUTE($D$2:$D$500,\" \",\"\") & \",\")\n         - LEN(SUBSTITUTE(\",\" & SUBSTITUTE($D$2:$D$500,\" \",\"\") & \",\", \",\" & _xlpm.id & \",\", \"\")))\n        / LEN(\",\" & _xlpm.id & \",\")\n      )\n    )\n  )\n)","v":"12009: 6 | 12011: 5 | 12018: 6 | 12016: 5 | 11015: 6 | 12010: 5 | 11020: 6 | 13034: 6"},null,null,null,null,"임프1",14023,"Melee"]
["스테이지 15-2",null,"광전사4, 다크엘프 마법사3, 다크엘프 기사4, 해골 기사3, 해골 기사4, 미노타우르스 챔피언1, 미노타우르스 챔피언2, 버그베어1",{"$f":"_xlfn.TEXTJOIN(\", \", TRUE,\n    _xlfn.MAP(TRIM(_xlfn.TEXTSPLIT(C93, \",\")),\n        _xlfn.LAMBDA(_xlpm.n,\n            _xlfn.LET(\n                _xlpm.result, _xlfn.XLOOKUP(_xlpm.n, J:J, K:K, \"\"),\n                IF(_xlpm.result = \"\", _xlpm.n, _xlpm.result)\n            )\n        )\n    )\n)","v":"12011, 12018, 12016, 13033, 13034, 11015, 11016, 11020"},{"$f":"_xlfn.TEXTJOIN(\" | \", TRUE,\n  _xlfn.MAP(TRIM(_xlfn.TEXTSPLIT(D93, \",\")),\n    _xlfn.LAMBDA(_xlpm.id,\n      _xlpm.id & \": \" &\n      SUMPRODUCT(\n        (LEN(\",\" & SUBSTITUTE($D$2:$D$500,\" \",\"\") & \",\")\n         - LEN(SUBSTITUTE(\",\" & SUBSTITUTE($D$2:$D$500,\" \",\"\") & \",\", \",\" & _xlpm.id & \",\", \"\")))\n        / LEN(\",\" & _xlpm.id & \",\")\n      )\n    )\n  )\n)","v":"12011: 5 | 12018: 6 | 12016: 5 | 13033: 6 | 13034: 6 | 11015: 6 | 11016: 5 | 11020: 6"},"흑기사1",10021,null,null,"임프3",14025,"Melee"]
["스테이지 15-3",null,"다크엘프 마법사3, 다크엘프 기사4, 미노타우르스 챔피언1, 미노타우르스 챔피언2, 버그베어1, 광전사4, 강도3",{"$f":"_xlfn.TEXTJOIN(\", \", TRUE,\n    _xlfn.MAP(TRIM(_xlfn.TEXTSPLIT(C94, \",\")),\n        _xlfn.LAMBDA(_xlpm.n,\n            _xlfn.LET(\n                _xlpm.result, _xlfn.XLOOKUP(_xlpm.n, J:J, K:K, \"\"),\n                IF(_xlpm.result = \"\", _xlpm.n, _xlpm.result)\n            )\n        )\n    )\n)","v":"12018, 12016, 11015, 11016, 11020, 12011, 12003"},{"$f":"_xlfn.TEXTJOIN(\" | \", TRUE,\n  _xlfn.MAP(TRIM(_xlfn.TEXTSPLIT(D94, \",\")),\n    _xlfn.LAMBDA(_xlpm.id,\n      _xlpm.id & \": \" &\n      SUMPRODUCT(\n        (LEN(\",\" & SUBSTITUTE($D$2:$D$500,\" \",\"\") & \",\")\n         - LEN(SUBSTITUTE(\",\" & SUBSTITUTE($D$2:$D$500,\" \",\"\") & \",\", \",\" & _xlpm.id & \",\", \"\")))\n        / LEN(\",\" & _xlpm.id & \",\")\n      )\n    )\n  )\n)","v":"12018: 6 | 12016: 5 | 11015: 6 | 11016: 5 | 11020: 6 | 12011: 5 | 12003: 6"},null,null,null,null,"임프 마법사4",14030,"Range"]
["스테이지 15-4",null,"악마 추종자1, 다크엘프 마법사3, 오크 워리어1, 버그베어1, 미노타우르스 챔피언1, 미노타우르스 챔피언2, 무리안, 연쇄살인마2",{"$f":"_xlfn.TEXTJOIN(\", \", TRUE,\n    _xlfn.MAP(TRIM(_xlfn.TEXTSPLIT(C95, \",\")),\n        _xlfn.LAMBDA(_xlpm.n,\n            _xlfn.LET(\n                _xlpm.result, _xlfn.XLOOKUP(_xlpm.n, J:J, K:K, \"\"),\n                IF(_xlpm.result = \"\", _xlpm.n, _xlpm.result)\n            )\n        )\n    )\n)","v":"13020, 12018, 12034, 11020, 11015, 11016, 14005, 12026"},{"$f":"_xlfn.TEXTJOIN(\" | \", TRUE,\n  _xlfn.MAP(TRIM(_xlfn.TEXTSPLIT(D95, \",\")),\n    _xlfn.LAMBDA(_xlpm.id,\n      _xlpm.id & \": \" &\n      SUMPRODUCT(\n        (LEN(\",\" & SUBSTITUTE($D$2:$D$500,\" \",\"\") & \",\")\n         - LEN(SUBSTITUTE(\",\" & SUBSTITUTE($D$2:$D$500,\" \",\"\") & \",\", \",\" & _xlpm.id & \",\", \"\")))\n        / LEN(\",\" & _xlpm.id & \",\")\n      )\n    )\n  )\n)","v":"13020: 6 | 12018: 6 | 12034: 5 | 11020: 6 | 11015: 6 | 11016: 5 | 14005: 6 | 12026: 6"},"메두사2",10020,null,null,"임프 전사2",14031,"Melee"]
["스테이지 15-5",null,"다크엘프 마법사3, 다크엘프 기사4, 오크 워리어1, 버그베어1, 무리안, 연쇄살인마2, 미노타우르스 챔피언1, 미노타우르스 챔피언2",{"$f":"_xlfn.TEXTJOIN(\", \", TRUE,\n    _xlfn.MAP(TRIM(_xlfn.TEXTSPLIT(C96, \",\")),\n        _xlfn.LAMBDA(_xlpm.n,\n            _xlfn.LET(\n                _xlpm.result, _xlfn.XLOOKUP(_xlpm.n, J:J, K:K, \"\"),\n                IF(_xlpm.result = \"\", _xlpm.n, _xlpm.result)\n            )\n        )\n    )\n)","v":"12018, 12016, 12034, 11020, 14005, 12026, 11015, 11016"},{"$f":"_xlfn.TEXTJOIN(\" | \", TRUE,\n  _xlfn.MAP(TRIM(_xlfn.TEXTSPLIT(D96, \",\")),\n    _xlfn.LAMBDA(_xlpm.id,\n      _xlpm.id & \": \" &\n      SUMPRODUCT(\n        (LEN(\",\" & SUBSTITUTE($D$2:$D$500,\" \",\"\") & \",\")\n         - LEN(SUBSTITUTE(\",\" & SUBSTITUTE($D$2:$D$500,\" \",\"\") & \",\", \",\" & _xlpm.id & \",\", \"\")))\n        / LEN(\",\" & _xlpm.id & \",\")\n      )\n    )\n  )\n)","v":"12018: 6 | 12016: 5 | 12034: 5 | 11020: 6 | 14005: 6 | 12026: 6 | 11015: 6 | 11016: 5"},"흑기사1",10021,null,null,"흡혈귀1",14034,"Melee"]
[null,null,null,null,null,null,null,null,6,"해골 기사2",13032,"Melee"]
["스테이지 16-1","⑥ 봉인 된 방","해골 기사2, 해골 기사3, 해골 기사4, 해골 법사, 다크엘프 기사4, 다크엘프 마법사3",{"$f":"_xlfn.TEXTJOIN(\", \", TRUE,\n    _xlfn.MAP(TRIM(_xlfn.TEXTSPLIT(C98, \",\")),\n        _xlfn.LAMBDA(_xlpm.n,\n            _xlfn.LET(\n                _xlpm.result, _xlfn.XLOOKUP(_xlpm.n, J:J, K:K, \"\"),\n                IF(_xlpm.result = \"\", _xlpm.n, _xlpm.result)\n            )\n        )\n    )\n)","v":"13032, 13033, 13034, 13030, 12016, 12018"},{"$f":"_xlfn.TEXTJOIN(\" | \", TRUE,\n  _xlfn.MAP(TRIM(_xlfn.TEXTSPLIT(D98, \",\")),\n    _xlfn.LAMBDA(_xlpm.id,\n      _xlpm.id & \": \" &\n      SUMPRODUCT(\n        (LEN(\",\" & SUBSTITUTE($D$2:$D$500,\" \",\"\") & \",\")\n         - LEN(SUBSTITUTE(\",\" & SUBSTITUTE($D$2:$D$500,\" \",\"\") & \",\", \",\" & _xlpm.id & \",\", \"\")))\n        / LEN(\",\" & _xlpm.id & \",\")\n      )\n    )\n  )\n)","v":"13032: 6 | 13033: 6 | 13034: 6 | 13030: 6 | 12016: 5 | 12018: 6"},"메두사2",10020,null,null,"강도1",12001,"Melee"]
["스테이지 16-2",null,"악마 추종자1, 강도1, 강도2, 강도3, 활든 강도1, 활든 강도2",{"$f":"_xlfn.TEXTJOIN(\", \", TRUE,\n    _xlfn.MAP(TRIM(_xlfn.TEXTSPLIT(C99, \",\")),\n        _xlfn.LAMBDA(_xlpm.n,\n            _xlfn.LET(\n                _xlpm.result, _xlfn.XLOOKUP(_xlpm.n, J:J, K:K, \"\"),\n                IF(_xlpm.result = \"\", _xlpm.n, _xlpm.result)\n            )\n        )\n    )\n)","v":"13020, 12001, 12002, 12003, 12035, 12036"},{"$f":"_xlfn.TEXTJOIN(\" | \", TRUE,\n  _xlfn.MAP(TRIM(_xlfn.TEXTSPLIT(D99, \",\")),\n    _xlfn.LAMBDA(_xlpm.id,\n      _xlpm.id & \": \" &\n      SUMPRODUCT(\n        (LEN(\",\" & SUBSTITUTE($D$2:$D$500,\" \",\"\") & \",\")\n         - LEN(SUBSTITUTE(\",\" & SUBSTITUTE($D$2:$D$500,\" \",\"\") & \",\", \",\" & _xlpm.id & \",\", \"\")))\n        / LEN(\",\" & _xlpm.id & \",\")\n      )\n    )\n  )\n)","v":"13020: 6 | 12001: 6 | 12002: 6 | 12003: 6 | 12035: 6 | 12036: 6"},"흑기사1",10021,null,null,"강도2",12002,"Melee"]
["스테이지 16-3",null,"버그베어1, 해골 기사2, 광전사2, 광전사4, 무리안, 데스나이트2, 연쇄살인마2, 해골 기사3",{"$f":"_xlfn.TEXTJOIN(\", \", TRUE,\n    _xlfn.MAP(TRIM(_xlfn.TEXTSPLIT(C100, \",\")),\n        _xlfn.LAMBDA(_xlpm.n,\n            _xlfn.LET(\n                _xlpm.result, _xlfn.XLOOKUP(_xlpm.n, J:J, K:K, \"\"),\n                IF(_xlpm.result = \"\", _xlpm.n, _xlpm.result)\n            )\n        )\n    )\n)","v":"11020, 13032, 12009, 12011, 14005, 13006, 12026, 13033"},{"$f":"_xlfn.TEXTJOIN(\" | \", TRUE,\n  _xlfn.MAP(TRIM(_xlfn.TEXTSPLIT(D100, \",\")),\n    _xlfn.LAMBDA(_xlpm.id,\n      _xlpm.id & \": \" &\n      SUMPRODUCT(\n        (LEN(\",\" & SUBSTITUTE($D$2:$D$500,\" \",\"\") & \",\")\n         - LEN(SUBSTITUTE(\",\" & SUBSTITUTE($D$2:$D$500,\" \",\"\") & \",\", \",\" & _xlpm.id & \",\", \"\")))\n        / LEN(\",\" & _xlpm.id & \",\")\n      )\n    )\n  )\n)","v":"11020: 6 | 13032: 6 | 12009: 6 | 12011: 5 | 14005: 6 | 13006: 5 | 12026: 6 | 13033: 6"},"레드드래곤3",10019,null,null,"강도3",12003,"Melee"]
[null,null,null,null,null,null,null,null,null,"연쇄살인마2",12026,"Melee"]
["스테이지 17-1","⑦ 용의 성지","다크엘프 기사2, 다크엘프 기사3, 스프리트, 악마 추종자2, 타락한 기사3, 임프4, 맹독사1",{"$f":"_xlfn.TEXTJOIN(\", \", TRUE,\n    _xlfn.MAP(TRIM(_xlfn.TEXTSPLIT(C102, \",\")),\n        _xlfn.LAMBDA(_xlpm.n,\n            _xlfn.LET(\n                _xlpm.result, _xlfn.XLOOKUP(_xlpm.n, J:J, K:K, \"\"),\n                IF(_xlpm.result = \"\", _xlpm.n, _xlpm.result)\n            )\n        )\n    )\n)","v":"12014, 12015, 14020, 13021, 13027, 14026, 14016"},{"$f":"_xlfn.TEXTJOIN(\" | \", TRUE,\n  _xlfn.MAP(TRIM(_xlfn.TEXTSPLIT(D102, \",\")),\n    _xlfn.LAMBDA(_xlpm.id,\n      _xlpm.id & \": \" &\n      SUMPRODUCT(\n        (LEN(\",\" & SUBSTITUTE($D$2:$D$500,\" \",\"\") & \",\")\n         - LEN(SUBSTITUTE(\",\" & SUBSTITUTE($D$2:$D$500,\" \",\"\") & \",\", \",\" & _xlpm.id & \",\", \"\")))\n        / LEN(\",\" & _xlpm.id & \",\")\n      )\n    )\n  )\n)","v":"12014: 7 | 12015: 6 | 14020: 7 | 13021: 7 | 13027: 6 | 14026: 7 | 14016: 7"},null,null,null,null,"악마 추종자1",13020,"Melee"]
["스테이지 17-2",null,"임프 마법사2, 스프리트, 악마 추종자2, 악마 추종자3, 타락한 기사3, 하피, 헤츨링1, 머미3",{"$f":"_xlfn.TEXTJOIN(\", \", TRUE,\n    _xlfn.MAP(TRIM(_xlfn.TEXTSPLIT(C103, \",\")),\n        _xlfn.LAMBDA(_xlpm.n,\n            _xlfn.LET(\n                _xlpm.result, _xlfn.XLOOKUP(_xlpm.n, J:J, K:K, \"\"),\n                IF(_xlpm.result = \"\", _xlpm.n, _xlpm.result)\n            )\n        )\n    )\n)","v":"14028, 14020, 13021, 13022, 13027, 14033, 15002, 13009"},{"$f":"_xlfn.TEXTJOIN(\" | \", TRUE,\n  _xlfn.MAP(TRIM(_xlfn.TEXTSPLIT(D103, \",\")),\n    _xlfn.LAMBDA(_xlpm.id,\n      _xlpm.id & \": \" &\n      SUMPRODUCT(\n        (LEN(\",\" & SUBSTITUTE($D$2:$D$500,\" \",\"\") & \",\")\n         - LEN(SUBSTITUTE(\",\" & SUBSTITUTE($D$2:$D$500,\" \",\"\") & \",\", \",\" & _xlpm.id & \",\", \"\")))\n        / LEN(\",\" & _xlpm.id & \",\")\n      )\n    )\n  )\n)","v":"14028: 7 | 14020: 7 | 13021: 7 | 13022: 6 | 13027: 6 | 14033: 7 | 15002: 7 | 13009: 6"},"용암골렘2",10022,null,null,"해골 법사",13030,"Range"]
["스테이지 17-3",null,"임프 마법사2, 임프4, 다크엘프 기사2, 머미3, 악마 추종자2, 타락한 기사3, 스프리트",{"$f":"_xlfn.TEXTJOIN(\", \", TRUE,\n    _xlfn.MAP(TRIM(_xlfn.TEXTSPLIT(C104, \",\")),\n        _xlfn.LAMBDA(_xlpm.n,\n            _xlfn.LET(\n                _xlpm.result, _xlfn.XLOOKUP(_xlpm.n, J:J, K:K, \"\"),\n                IF(_xlpm.result = \"\", _xlpm.n, _xlpm.result)\n            )\n        )\n    )\n)","v":"14028, 14026, 12014, 13009, 13021, 13027, 14020"},{"$f":"_xlfn.TEXTJOIN(\" | \", TRUE,\n  _xlfn.MAP(TRIM(_xlfn.TEXTSPLIT(D104, \",\")),\n    _xlfn.LAMBDA(_xlpm.id,\n      _xlpm.id & \": \" &\n      SUMPRODUCT(\n        (LEN(\",\" & SUBSTITUTE($D$2:$D$500,\" \",\"\") & \",\")\n         - LEN(SUBSTITUTE(\",\" & SUBSTITUTE($D$2:$D$500,\" \",\"\") & \",\", \",\" & _xlpm.id & \",\", \"\")))\n        / LEN(\",\" & _xlpm.id & \",\")\n      )\n    )\n  )\n)","v":"14028: 7 | 14026: 7 | 12014: 7 | 13009: 6 | 13021: 7 | 13027: 6 | 14020: 7"},null,null,null,null,"해골 기사3",13033,"Melee"]
["스테이지 17-4",null,"헤츨링1, 스프리트, 바포메트4, 머미3, 셀로브, 임프4, 악마 추종자2, 악마 추종자3",{"$f":"_xlfn.TEXTJOIN(\", \", TRUE,\n    _xlfn.MAP(TRIM(_xlfn.TEXTSPLIT(C105, \",\")),\n        _xlfn.LAMBDA(_xlpm.n,\n            _xlfn.LET(\n                _xlpm.result, _xlfn.XLOOKUP(_xlpm.n, J:J, K:K, \"\"),\n                IF(_xlpm.result = \"\", _xlpm.n, _xlpm.result)\n            )\n        )\n    )\n)","v":"15002, 14020, 13012, 13009, 14019, 14026, 13021, 13022"},{"$f":"_xlfn.TEXTJOIN(\" | \", TRUE,\n  _xlfn.MAP(TRIM(_xlfn.TEXTSPLIT(D105, \",\")),\n    _xlfn.LAMBDA(_xlpm.id,\n      _xlpm.id & \": \" &\n      SUMPRODUCT(\n        (LEN(\",\" & SUBSTITUTE($D$2:$D$500,\" \",\"\") & \",\")\n         - LEN(SUBSTITUTE(\",\" & SUBSTITUTE($D$2:$D$500,\" \",\"\") & \",\", \",\" & _xlpm.id & \",\", \"\")))\n        / LEN(\",\" & _xlpm.id & \",\")\n      )\n    )\n  )\n)","v":"15002: 7 | 14020: 7 | 13012: 7 | 13009: 6 | 14019: 7 | 14026: 7 | 13021: 7 | 13022: 6"},"레드드래곤1",10023,null,null,"해골 기사4",13034,"Melee"]
["스테이지 17-5",null,"다크엘프 기사2, 다크엘프 기사3, 바포메트4, 하피, 악마 추종자3, 바포메트1, 맹독사1",{"$f":"_xlfn.TEXTJOIN(\", \", TRUE,\n    _xlfn.MAP(TRIM(_xlfn.TEXTSPLIT(C106, \",\")),\n        _xlfn.LAMBDA(_xlpm.n,\n            _xlfn.LET(\n                _xlpm.result, _xlfn.XLOOKUP(_xlpm.n, J:J, K:K, \"\"),\n                IF(_xlpm.result = \"\", _xlpm.n, _xlpm.result)\n            )\n        )\n    )\n)","v":"12014, 12015, 13012, 14033, 13022, 13010, 14016"},{"$f":"_xlfn.TEXTJOIN(\" | \", TRUE,\n  _xlfn.MAP(TRIM(_xlfn.TEXTSPLIT(D106, \",\")),\n    _xlfn.LAMBDA(_xlpm.id,\n      _xlpm.id & \": \" &\n      SUMPRODUCT(\n        (LEN(\",\" & SUBSTITUTE($D$2:$D$500,\" \",\"\") & \",\")\n         - LEN(SUBSTITUTE(\",\" & SUBSTITUTE($D$2:$D$500,\" \",\"\") & \",\", \",\" & _xlpm.id & \",\", \"\")))\n        / LEN(\",\" & _xlpm.id & \",\")\n      )\n    )\n  )\n)","v":"12014: 7 | 12015: 6 | 13012: 7 | 14033: 7 | 13022: 6 | 13010: 7 | 14016: 7"},null,null,null,null,"미노타우르스 챔피언1",11015,"Melee"]
["스테이지 17-6",null,"바포메트1, 셀로브, 머미3, 악마 추종자2, 악마 추종자3, 셀로브, 리자드맨, 리자드맨",{"$f":"_xlfn.TEXTJOIN(\", \", TRUE,\n    _xlfn.MAP(TRIM(_xlfn.TEXTSPLIT(C107, \",\")),\n        _xlfn.LAMBDA(_xlpm.n,\n            _xlfn.LET(\n                _xlpm.result, _xlfn.XLOOKUP(_xlpm.n, J:J, K:K, \"\"),\n                IF(_xlpm.result = \"\", _xlpm.n, _xlpm.result)\n            )\n        )\n    )\n)","v":"13010, 14019, 13009, 13021, 13022, 14019, 14015, 14015"},{"$f":"_xlfn.TEXTJOIN(\" | \", TRUE,\n  _xlfn.MAP(TRIM(_xlfn.TEXTSPLIT(D107, \",\")),\n    _xlfn.LAMBDA(_xlpm.id,\n      _xlpm.id & \": \" &\n      SUMPRODUCT(\n        (LEN(\",\" & SUBSTITUTE($D$2:$D$500,\" \",\"\") & \",\")\n         - LEN(SUBSTITUTE(\",\" & SUBSTITUTE($D$2:$D$500,\" \",\"\") & \",\", \",\" & _xlpm.id & \",\", \"\")))\n        / LEN(\",\" & _xlpm.id & \",\")\n      )\n    )\n  )\n)","v":"13010: 7 | 14019: 7 | 13009: 6 | 13021: 7 | 13022: 6 | 14019: 7 | 14015: 7 | 14015: 7"},"용암골렘2",10022,null,null,"미노타우르스 챔피언2",11016,"Melee"]
["스테이지 17-7",null,"바포메트1, 임프4, 하피, 헤츨링1, 다크엘프 기사3, 다크엘프 기사2, 타이가",{"$f":"_xlfn.TEXTJOIN(\", \", TRUE,\n    _xlfn.MAP(TRIM(_xlfn.TEXTSPLIT(C108, \",\")),\n        _xlfn.LAMBDA(_xlpm.n,\n            _xlfn.LET(\n                _xlpm.result, _xlfn.XLOOKUP(_xlpm.n, J:J, K:K, \"\"),\n                IF(_xlpm.result = \"\", _xlpm.n, _xlpm.result)\n            )\n        )\n    )\n)","v":"13010, 14026, 14033, 15002, 12015, 12014, 14006"},{"$f":"_xlfn.TEXTJOIN(\" | \", TRUE,\n  _xlfn.MAP(TRIM(_xlfn.TEXTSPLIT(D108, \",\")),\n    _xlfn.LAMBDA(_xlpm.id,\n      _xlpm.id & \": \" &\n      SUMPRODUCT(\n        (LEN(\",\" & SUBSTITUTE($D$2:$D$500,\" \",\"\") & \",\")\n         - LEN(SUBSTITUTE(\",\" & SUBSTITUTE($D$2:$D$500,\" \",\"\") & \",\", \",\" & _xlpm.id & \",\", \"\")))\n        / LEN(\",\" & _xlpm.id & \",\")\n      )\n    )\n  )\n)","v":"13010: 7 | 14026: 7 | 14033: 7 | 15002: 7 | 12015: 6 | 12014: 7 | 14006: 6"},null,null,null,null,"다크엘프 기사4",12016,"Melee"]
["스테이지 17-8",null,"하피, 바포메트1, 임프4, 하피, 헤츨링1, 바포메트4, 오우거3, 타이가, 켄타우로스",{"$f":"_xlfn.TEXTJOIN(\", \", TRUE,\n    _xlfn.MAP(TRIM(_xlfn.TEXTSPLIT(C109, \",\")),\n        _xlfn.LAMBDA(_xlpm.n,\n            _xlfn.LET(\n                _xlpm.result, _xlfn.XLOOKUP(_xlpm.n, J:J, K:K, \"\"),\n                IF(_xlpm.result = \"\", _xlpm.n, _xlpm.result)\n            )\n        )\n    )\n)","v":"14033, 13010, 14026, 14033, 15002, 13012, 15012, 14006, 14004"},{"$f":"_xlfn.TEXTJOIN(\" | \", TRUE,\n  _xlfn.MAP(TRIM(_xlfn.TEXTSPLIT(D109, \",\")),\n    _xlfn.LAMBDA(_xlpm.id,\n      _xlpm.id & \": \" &\n      SUMPRODUCT(\n        (LEN(\",\" & SUBSTITUTE($D$2:$D$500,\" \",\"\") & \",\")\n         - LEN(SUBSTITUTE(\",\" & SUBSTITUTE($D$2:$D$500,\" \",\"\") & \",\", \",\" & _xlpm.id & \",\", \"\")))\n        / LEN(\",\" & _xlpm.id & \",\")\n      )\n    )\n  )\n)","v":"14033: 7 | 13010: 7 | 14026: 7 | 14033: 7 | 15002: 7 | 13012: 7 | 15012: 7 | 14006: 6 | 14004: 6"},"레드드래곤1",10023,null,null,"데스나이트2",13006,"Melee"]
[null,null,null,null,null,null,null,null,null,"악마 광신자3",13018,"Range"]
["스테이지 18-1","⑦ 악마의 신전","켄타우로스, 다크엘프 기사3, 타락한 기사3, 맹독사1, 타이가, 오우거3, 바포메트1, 리자드맨",{"$f":"_xlfn.TEXTJOIN(\", \", TRUE,\n    _xlfn.MAP(TRIM(_xlfn.TEXTSPLIT(C111, \",\")),\n        _xlfn.LAMBDA(_xlpm.n,\n            _xlfn.LET(\n                _xlpm.result, _xlfn.XLOOKUP(_xlpm.n, J:J, K:K, \"\"),\n                IF(_xlpm.result = \"\", _xlpm.n, _xlpm.result)\n            )\n        )\n    )\n)","v":"14004, 12015, 13027, 14016, 14006, 15012, 13010, 14015"},{"$f":"_xlfn.TEXTJOIN(\" | \", TRUE,\n  _xlfn.MAP(TRIM(_xlfn.TEXTSPLIT(D111, \",\")),\n    _xlfn.LAMBDA(_xlpm.id,\n      _xlpm.id & \": \" &\n      SUMPRODUCT(\n        (LEN(\",\" & SUBSTITUTE($D$2:$D$500,\" \",\"\") & \",\")\n         - LEN(SUBSTITUTE(\",\" & SUBSTITUTE($D$2:$D$500,\" \",\"\") & \",\", \",\" & _xlpm.id & \",\", \"\")))\n        / LEN(\",\" & _xlpm.id & \",\")\n      )\n    )\n  )\n)","v":"14004: 6 | 12015: 6 | 13027: 6 | 14016: 7 | 14006: 6 | 15012: 7 | 13010: 7 | 14015: 7"},null,null,null,null,"무리안",14005,"Melee"]
["스테이지 18-2",null,"임프 마법사2, 스프리트, 타락한 기사3, 리자드맨, 오우거3, 맹독사1, 임프 마법사2",{"$f":"_xlfn.TEXTJOIN(\", \", TRUE,\n    _xlfn.MAP(TRIM(_xlfn.TEXTSPLIT(C112, \",\")),\n        _xlfn.LAMBDA(_xlpm.n,\n            _xlfn.LET(\n                _xlpm.result, _xlfn.XLOOKUP(_xlpm.n, J:J, K:K, \"\"),\n                IF(_xlpm.result = \"\", _xlpm.n, _xlpm.result)\n            )\n        )\n    )\n)","v":"14028, 14020, 13027, 14015, 15012, 14016, 14028"},{"$f":"_xlfn.TEXTJOIN(\" | \", TRUE,\n  _xlfn.MAP(TRIM(_xlfn.TEXTSPLIT(D112, \",\")),\n    _xlfn.LAMBDA(_xlpm.id,\n      _xlpm.id & \": \" &\n      SUMPRODUCT(\n        (LEN(\",\" & SUBSTITUTE($D$2:$D$500,\" \",\"\") & \",\")\n         - LEN(SUBSTITUTE(\",\" & SUBSTITUTE($D$2:$D$500,\" \",\"\") & \",\", \",\" & _xlpm.id & \",\", \"\")))\n        / LEN(\",\" & _xlpm.id & \",\")\n      )\n    )\n  )\n)","v":"14028: 7 | 14020: 7 | 13027: 6 | 14015: 7 | 15012: 7 | 14016: 7 | 14028: 7"},"바포메트7",10024,null,null,"버그베어1",11020,"Melee"]
["스테이지 18-3",null,"임프 마법사2, 임프4, 맹독사1, 머미3, 타락한 기사3, 스프리트, 리자드맨, 타이가, 다크엘프 기사2",{"$f":"_xlfn.TEXTJOIN(\", \", TRUE,\n    _xlfn.MAP(TRIM(_xlfn.TEXTSPLIT(C113, \",\")),\n        _xlfn.LAMBDA(_xlpm.n,\n            _xlfn.LET(\n                _xlpm.result, _xlfn.XLOOKUP(_xlpm.n, J:J, K:K, \"\"),\n                IF(_xlpm.result = \"\", _xlpm.n, _xlpm.result)\n            )\n        )\n    )\n)","v":"14028, 14026, 14016, 13009, 13027, 14020, 14015, 14006, 12014"},{"$f":"_xlfn.TEXTJOIN(\" | \", TRUE,\n  _xlfn.MAP(TRIM(_xlfn.TEXTSPLIT(D113, \",\")),\n    _xlfn.LAMBDA(_xlpm.id,\n      _xlpm.id & \": \" &\n      SUMPRODUCT(\n        (LEN(\",\" & SUBSTITUTE($D$2:$D$500,\" \",\"\") & \",\")\n         - LEN(SUBSTITUTE(\",\" & SUBSTITUTE($D$2:$D$500,\" \",\"\") & \",\", \",\" & _xlpm.id & \",\", \"\")))\n        / LEN(\",\" & _xlpm.id & \",\")\n      )\n    )\n  )\n)","v":"14028: 7 | 14026: 7 | 14016: 7 | 13009: 6 | 13027: 6 | 14020: 7 | 14015: 7 | 14006: 6 | 12014: 7"},"용암골렘2",10022,null,null,"광전사2",12009,"Melee"]
["스테이지 18-4",null,"헤츨링1, 켄타우로스, 바포메트4, 셀로브, 임프4, 악마 추종자2, 리자드맨, 스프리트",{"$f":"_xlfn.TEXTJOIN(\", \", TRUE,\n    _xlfn.MAP(TRIM(_xlfn.TEXTSPLIT(C114, \",\")),\n        _xlfn.LAMBDA(_xlpm.n,\n            _xlfn.LET(\n                _xlpm.result, _xlfn.XLOOKUP(_xlpm.n, J:J, K:K, \"\"),\n                IF(_xlpm.result = \"\", _xlpm.n, _xlpm.result)\n            )\n        )\n    )\n)","v":"15002, 14004, 13012, 14019, 14026, 13021, 14015, 14020"},{"$f":"_xlfn.TEXTJOIN(\" | \", TRUE,\n  _xlfn.MAP(TRIM(_xlfn.TEXTSPLIT(D114, \",\")),\n    _xlfn.LAMBDA(_xlpm.id,\n      _xlpm.id & \": \" &\n      SUMPRODUCT(\n        (LEN(\",\" & SUBSTITUTE($D$2:$D$500,\" \",\"\") & \",\")\n         - LEN(SUBSTITUTE(\",\" & SUBSTITUTE($D$2:$D$500,\" \",\"\") & \",\", \",\" & _xlpm.id & \",\", \"\")))\n        / LEN(\",\" & _xlpm.id & \",\")\n      )\n    )\n  )\n)","v":"15002: 7 | 14004: 6 | 13012: 7 | 14019: 7 | 14026: 7 | 13021: 7 | 14015: 7 | 14020: 7"},"레드드래곤1",10023,null,null,"광전사4",12011,"Melee"]
["스테이지 18-5",null,"다크엘프 기사2, 다크엘프 기사3, 바포메트4, 악마 추종자3, 맹독사1, 하피, 헤츨링1, 오우거3",{"$f":"_xlfn.TEXTJOIN(\", \", TRUE,\n    _xlfn.MAP(TRIM(_xlfn.TEXTSPLIT(C115, \",\")),\n        _xlfn.LAMBDA(_xlpm.n,\n            _xlfn.LET(\n                _xlpm.result, _xlfn.XLOOKUP(_xlpm.n, J:J, K:K, \"\"),\n                IF(_xlpm.result = \"\", _xlpm.n, _xlpm.result)\n            )\n        )\n    )\n)","v":"12014, 12015, 13012, 13022, 14016, 14033, 15002, 15012"},{"$f":"_xlfn.TEXTJOIN(\" | \", TRUE,\n  _xlfn.MAP(TRIM(_xlfn.TEXTSPLIT(D115, \",\")),\n    _xlfn.LAMBDA(_xlpm.id,\n      _xlpm.id & \": \" &\n      SUMPRODUCT(\n        (LEN(\",\" & SUBSTITUTE($D$2:$D$500,\" \",\"\") & \",\")\n         - LEN(SUBSTITUTE(\",\" & SUBSTITUTE($D$2:$D$500,\" \",\"\") & \",\", \",\" & _xlpm.id & \",\", \"\")))\n        / LEN(\",\" & _xlpm.id & \",\")\n      )\n    )\n  )\n)","v":"12014: 7 | 12015: 6 | 13012: 7 | 13022: 6 | 14016: 7 | 14033: 7 | 15002: 7 | 15012: 7"},null,null,null,null,"다크엘프 마법사3",12018,"Range"]
["스테이지 18-6",null,"타이가, 오우거3, 셀로브, 머미3, 악마 추종자2, 악마 추종자3, 리자드맨, 켄타우로스, 바포메트4",{"$f":"_xlfn.TEXTJOIN(\", \", TRUE,\n    _xlfn.MAP(TRIM(_xlfn.TEXTSPLIT(C116, \",\")),\n        _xlfn.LAMBDA(_xlpm.n,\n            _xlfn.LET(\n                _xlpm.result, _xlfn.XLOOKUP(_xlpm.n, J:J, K:K, \"\"),\n                IF(_xlpm.result = \"\", _xlpm.n, _xlpm.result)\n            )\n        )\n    )\n)","v":"14006, 15012, 14019, 13009, 13021, 13022, 14015, 14004, 13012"},{"$f":"_xlfn.TEXTJOIN(\" | \", TRUE,\n  _xlfn.MAP(TRIM(_xlfn.TEXTSPLIT(D116, \",\")),\n    _xlfn.LAMBDA(_xlpm.id,\n      _xlpm.id & \": \" &\n      SUMPRODUCT(\n        (LEN(\",\" & SUBSTITUTE($D$2:$D$500,\" \",\"\") & \",\")\n         - LEN(SUBSTITUTE(\",\" & SUBSTITUTE($D$2:$D$500,\" \",\"\") & \",\", \",\" & _xlpm.id & \",\", \"\")))\n        / LEN(\",\" & _xlpm.id & \",\")\n      )\n    )\n  )\n)","v":"14006: 6 | 15012: 7 | 14019: 7 | 13009: 6 | 13021: 7 | 13022: 6 | 14015: 7 | 14004: 6 | 13012: 7"},"바포메트7",10024,null,null,"오크 워리어1",12034,"Melee"]
["스테이지 18-7",null,"타이가, 오우거3, 바포메트1, 다크엘프 기사3, 다크엘프 기사2, 임프 마법사2, 맹독사1, 켄타우로스",{"$f":"_xlfn.TEXTJOIN(\", \", TRUE,\n    _xlfn.MAP(TRIM(_xlfn.TEXTSPLIT(C117, \",\")),\n        _xlfn.LAMBDA(_xlpm.n,\n            _xlfn.LET(\n                _xlpm.result, _xlfn.XLOOKUP(_xlpm.n, J:J, K:K, \"\"),\n                IF(_xlpm.result = \"\", _xlpm.n, _xlpm.result)\n            )\n        )\n    )\n)","v":"14006, 15012, 13010, 12015, 12014, 14028, 14016, 14004"},{"$f":"_xlfn.TEXTJOIN(\" | \", TRUE,\n  _xlfn.MAP(TRIM(_xlfn.TEXTSPLIT(D117, \",\")),\n    _xlfn.LAMBDA(_xlpm.id,\n      _xlpm.id & \": \" &\n      SUMPRODUCT(\n        (LEN(\",\" & SUBSTITUTE($D$2:$D$500,\" \",\"\") & \",\")\n         - LEN(SUBSTITUTE(\",\" & SUBSTITUTE($D$2:$D$500,\" \",\"\") & \",\", \",\" & _xlpm.id & \",\", \"\")))\n        / LEN(\",\" & _xlpm.id & \",\")\n      )\n    )\n  )\n)","v":"14006: 6 | 15012: 7 | 13010: 7 | 12015: 6 | 12014: 7 | 14028: 7 | 14016: 7 | 14004: 6"},null,null,null,null,"활든 강도1",12035,"Range"]
["스테이지 18-8",null,"셀로브, 바포메트1, 켄타우로스, 헤츨링1, 바포메트4, 오우거3, 리자드맨, 임프 마법사2, 하피",{"$f":"_xlfn.TEXTJOIN(\", \", TRUE,\n    _xlfn.MAP(TRIM(_xlfn.TEXTSPLIT(C118, \",\")),\n        _xlfn.LAMBDA(_xlpm.n,\n            _xlfn.LET(\n                _xlpm.result, _xlfn.XLOOKUP(_xlpm.n, J:J, K:K, \"\"),\n                IF(_xlpm.result = \"\", _xlpm.n, _xlpm.result)\n            )\n        )\n    )\n)","v":"14019, 13010, 14004, 15002, 13012, 15012, 14015, 14028, 14033"},{"$f":"_xlfn.TEXTJOIN(\" | \", TRUE,\n  _xlfn.MAP(TRIM(_xlfn.TEXTSPLIT(D118, \",\")),\n    _xlfn.LAMBDA(_xlpm.id,\n      _xlpm.id & \": \" &\n      SUMPRODUCT(\n        (LEN(\",\" & SUBSTITUTE($D$2:$D$500,\" \",\"\") & \",\")\n         - LEN(SUBSTITUTE(\",\" & SUBSTITUTE($D$2:$D$500,\" \",\"\") & \",\", \",\" & _xlpm.id & \",\", \"\")))\n        / LEN(\",\" & _xlpm.id & \",\")\n      )\n    )\n  )\n)","v":"14019: 7 | 13010: 7 | 14004: 6 | 15002: 7 | 13012: 7 | 15012: 7 | 14015: 7 | 14028: 7 | 14033: 7"},"바포메트7",10024,null,7,"다크엘프 기사2",12014,"Melee"]
[null,null,null,null,null,null,null,null,null,"다크엘프 기사3",12015,"Melee"]
["스테이지 19-1","⑧ 마왕의 탑","약탈꾼2, 예티6, 셀로브, 트롤 워리어1, 악마 광신자1, 트롤 워리어5",{"$f":"_xlfn.TEXTJOIN(\", \", TRUE,\n    _xlfn.MAP(TRIM(_xlfn.TEXTSPLIT(C120, \",\")),\n        _xlfn.LAMBDA(_xlpm.n,\n            _xlfn.LET(\n                _xlpm.result, _xlfn.XLOOKUP(_xlpm.n, J:J, K:K, \"\"),\n                IF(_xlpm.result = \"\", _xlpm.n, _xlpm.result)\n            )\n        )\n    )\n)","v":"15005, 15010, 14019, 15014, 13016, 15017"},{"$f":"_xlfn.TEXTJOIN(\" | \", TRUE,\n  _xlfn.MAP(TRIM(_xlfn.TEXTSPLIT(D120, \",\")),\n    _xlfn.LAMBDA(_xlpm.id,\n      _xlpm.id & \": \" &\n      SUMPRODUCT(\n        (LEN(\",\" & SUBSTITUTE($D$2:$D$500,\" \",\"\") & \",\")\n         - LEN(SUBSTITUTE(\",\" & SUBSTITUTE($D$2:$D$500,\" \",\"\") & \",\", \",\" & _xlpm.id & \",\", \"\")))\n        / LEN(\",\" & _xlpm.id & \",\")\n      )\n    )\n  )\n)","v":"15005: 5 | 15010: 6 | 14019: 7 | 15014: 6 | 13016: 7 | 15017: 5"},null,null,null,null,"머미3",13009,"Melee"]
["스테이지 19-2",null,"트롤 워리어1, 트롤 워리어3, 트롤 워리어5, 트롤 워리어6, 트롤 워리어7, 바포메트3",{"$f":"_xlfn.TEXTJOIN(\", \", TRUE,\n    _xlfn.MAP(TRIM(_xlfn.TEXTSPLIT(C121, \",\")),\n        _xlfn.LAMBDA(_xlpm.n,\n            _xlfn.LET(\n                _xlpm.result, _xlfn.XLOOKUP(_xlpm.n, J:J, K:K, \"\"),\n                IF(_xlpm.result = \"\", _xlpm.n, _xlpm.result)\n            )\n        )\n    )\n)","v":"15014, 15016, 15017, 15018, 15019, 13011"},{"$f":"_xlfn.TEXTJOIN(\" | \", TRUE,\n  _xlfn.MAP(TRIM(_xlfn.TEXTSPLIT(D121, \",\")),\n    _xlfn.LAMBDA(_xlpm.id,\n      _xlpm.id & \": \" &\n      SUMPRODUCT(\n        (LEN(\",\" & SUBSTITUTE($D$2:$D$500,\" \",\"\") & \",\")\n         - LEN(SUBSTITUTE(\",\" & SUBSTITUTE($D$2:$D$500,\" \",\"\") & \",\", \",\" & _xlpm.id & \",\", \"\")))\n        / LEN(\",\" & _xlpm.id & \",\")\n      )\n    )\n  )\n)","v":"15014: 6 | 15016: 6 | 15017: 5 | 15018: 5 | 15019: 5 | 13011: 7"},"거미 여왕1",10025,null,null,"바포메트1",13010,"Range"]
["스테이지 19-3",null,"바포메트3, 오우거2, 예티5, 예티3, 바포메트5",{"$f":"_xlfn.TEXTJOIN(\", \", TRUE,\n    _xlfn.MAP(TRIM(_xlfn.TEXTSPLIT(C122, \",\")),\n        _xlfn.LAMBDA(_xlpm.n,\n            _xlfn.LET(\n                _xlpm.result, _xlfn.XLOOKUP(_xlpm.n, J:J, K:K, \"\"),\n                IF(_xlpm.result = \"\", _xlpm.n, _xlpm.result)\n            )\n        )\n    )\n)","v":"13011, 15011, 15009, 15008, 13013"},{"$f":"_xlfn.TEXTJOIN(\" | \", TRUE,\n  _xlfn.MAP(TRIM(_xlfn.TEXTSPLIT(D122, \",\")),\n    _xlfn.LAMBDA(_xlpm.id,\n      _xlpm.id & \": \" &\n      SUMPRODUCT(\n        (LEN(\",\" & SUBSTITUTE($D$2:$D$500,\" \",\"\") & \",\")\n         - LEN(SUBSTITUTE(\",\" & SUBSTITUTE($D$2:$D$500,\" \",\"\") & \",\", \",\" & _xlpm.id & \",\", \"\")))\n        / LEN(\",\" & _xlpm.id & \",\")\n      )\n    )\n  )\n)","v":"13011: 7 | 15011: 5 | 15009: 6 | 15008: 5 | 13013: 7"},null,null,null,null,"맹독사1",14016,"Melee"]
["스테이지 19-4",null,"오우거2, 엘더 예티2, 트롤 워리어3, 트롤 워리어6, 트롤 워리어7, 바포메트5",{"$f":"_xlfn.TEXTJOIN(\", \", TRUE,\n    _xlfn.MAP(TRIM(_xlfn.TEXTSPLIT(C123, \",\")),\n        _xlfn.LAMBDA(_xlpm.n,\n            _xlfn.LET(\n                _xlpm.result, _xlfn.XLOOKUP(_xlpm.n, J:J, K:K, \"\"),\n                IF(_xlpm.result = \"\", _xlpm.n, _xlpm.result)\n            )\n        )\n    )\n)","v":"15011, 15007, 15016, 15018, 15019, 13013"},{"$f":"_xlfn.TEXTJOIN(\" | \", TRUE,\n  _xlfn.MAP(TRIM(_xlfn.TEXTSPLIT(D123, \",\")),\n    _xlfn.LAMBDA(_xlpm.id,\n      _xlpm.id & \": \" &\n      SUMPRODUCT(\n        (LEN(\",\" & SUBSTITUTE($D$2:$D$500,\" \",\"\") & \",\")\n         - LEN(SUBSTITUTE(\",\" & SUBSTITUTE($D$2:$D$500,\" \",\"\") & \",\", \",\" & _xlpm.id & \",\", \"\")))\n        / LEN(\",\" & _xlpm.id & \",\")\n      )\n    )\n  )\n)","v":"15011: 5 | 15007: 5 | 15016: 6 | 15018: 5 | 15019: 5 | 13013: 7"},"데스나이트1",10026,null,null,"스프리트",14020,"Melee"]
["스테이지 19-5",null,"트롤 워리어3, 트롤 워리어5, 엘더 예티1, 예티3, 약탈꾼1",{"$f":"_xlfn.TEXTJOIN(\", \", TRUE,\n    _xlfn.MAP(TRIM(_xlfn.TEXTSPLIT(C124, \",\")),\n        _xlfn.LAMBDA(_xlpm.n,\n            _xlfn.LET(\n                _xlpm.result, _xlfn.XLOOKUP(_xlpm.n, J:J, K:K, \"\"),\n                IF(_xlpm.result = \"\", _xlpm.n, _xlpm.result)\n            )\n        )\n    )\n)","v":"15016, 15017, 15006, 15008, 15004"},{"$f":"_xlfn.TEXTJOIN(\" | \", TRUE,\n  _xlfn.MAP(TRIM(_xlfn.TEXTSPLIT(D124, \",\")),\n    _xlfn.LAMBDA(_xlpm.id,\n      _xlpm.id & \": \" &\n      SUMPRODUCT(\n        (LEN(\",\" & SUBSTITUTE($D$2:$D$500,\" \",\"\") & \",\")\n         - LEN(SUBSTITUTE(\",\" & SUBSTITUTE($D$2:$D$500,\" \",\"\") & \",\", \",\" & _xlpm.id & \",\", \"\")))\n        / LEN(\",\" & _xlpm.id & \",\")\n      )\n    )\n  )\n)","v":"15016: 6 | 15017: 5 | 15006: 5 | 15008: 5 | 15004: 5"},null,null,null,null,"바포메트4",13012,"Range"]
["스테이지 19-6",null,"약탈꾼2, 싸이 전사, 예티3, 예티5, 악마 광신자1, 바포메트3",{"$f":"_xlfn.TEXTJOIN(\", \", TRUE,\n    _xlfn.MAP(TRIM(_xlfn.TEXTSPLIT(C125, \",\")),\n        _xlfn.LAMBDA(_xlpm.n,\n            _xlfn.LET(\n                _xlpm.result, _xlfn.XLOOKUP(_xlpm.n, J:J, K:K, \"\"),\n                IF(_xlpm.result = \"\", _xlpm.n, _xlpm.result)\n            )\n        )\n    )\n)","v":"15005, 15001, 15008, 15009, 13016, 13011"},{"$f":"_xlfn.TEXTJOIN(\" | \", TRUE,\n  _xlfn.MAP(TRIM(_xlfn.TEXTSPLIT(D125, \",\")),\n    _xlfn.LAMBDA(_xlpm.id,\n      _xlpm.id & \": \" &\n      SUMPRODUCT(\n        (LEN(\",\" & SUBSTITUTE($D$2:$D$500,\" \",\"\") & \",\")\n         - LEN(SUBSTITUTE(\",\" & SUBSTITUTE($D$2:$D$500,\" \",\"\") & \",\", \",\" & _xlpm.id & \",\", \"\")))\n        / LEN(\",\" & _xlpm.id & \",\")\n      )\n    )\n  )\n)","v":"15005: 5 | 15001: 5 | 15008: 5 | 15009: 6 | 13016: 7 | 13011: 7"},"거미 여왕1",10025,null,null,"악마 추종자2",13021,"Melee"]
["스테이지 19-7",null,"바포메트3, 바포메트5, 트롤 워리어6, 약탈꾼1, 약탈꾼2",{"$f":"_xlfn.TEXTJOIN(\", \", TRUE,\n    _xlfn.MAP(TRIM(_xlfn.TEXTSPLIT(C126, \",\")),\n        _xlfn.LAMBDA(_xlpm.n,\n            _xlfn.LET(\n                _xlpm.result, _xlfn.XLOOKUP(_xlpm.n, J:J, K:K, \"\"),\n                IF(_xlpm.result = \"\", _xlpm.n, _xlpm.result)\n            )\n        )\n    )\n)","v":"13011, 13013, 15018, 15004, 15005"},{"$f":"_xlfn.TEXTJOIN(\" | \", TRUE,\n  _xlfn.MAP(TRIM(_xlfn.TEXTSPLIT(D126, \",\")),\n    _xlfn.LAMBDA(_xlpm.id,\n      _xlpm.id & \": \" &\n      SUMPRODUCT(\n        (LEN(\",\" & SUBSTITUTE($D$2:$D$500,\" \",\"\") & \",\")\n         - LEN(SUBSTITUTE(\",\" & SUBSTITUTE($D$2:$D$500,\" \",\"\") & \",\", \",\" & _xlpm.id & \",\", \"\")))\n        / LEN(\",\" & _xlpm.id & \",\")\n      )\n    )\n  )\n)","v":"13011: 7 | 13013: 7 | 15018: 5 | 15004: 5 | 15005: 5"},null,null,null,null,"악마 추종자3",13022,"Melee"]
["스테이지 19-8",null,"약탈꾼1, 약탈꾼2, 용암골렘1, 엘더 예티1, 엘더 예티2",{"$f":"_xlfn.TEXTJOIN(\", \", TRUE,\n    _xlfn.MAP(TRIM(_xlfn.TEXTSPLIT(C127, \",\")),\n        _xlfn.LAMBDA(_xlpm.n,\n            _xlfn.LET(\n                _xlpm.result, _xlfn.XLOOKUP(_xlpm.n, J:J, K:K, \"\"),\n                IF(_xlpm.result = \"\", _xlpm.n, _xlpm.result)\n            )\n        )\n    )\n)","v":"15004, 15005, 15013, 15006, 15007"},{"$f":"_xlfn.TEXTJOIN(\" | \", TRUE,\n  _xlfn.MAP(TRIM(_xlfn.TEXTSPLIT(D127, \",\")),\n    _xlfn.LAMBDA(_xlpm.id,\n      _xlpm.id & \": \" &\n      SUMPRODUCT(\n        (LEN(\",\" & SUBSTITUTE($D$2:$D$500,\" \",\"\") & \",\")\n         - LEN(SUBSTITUTE(\",\" & SUBSTITUTE($D$2:$D$500,\" \",\"\") & \",\", \",\" & _xlpm.id & \",\", \"\")))\n        / LEN(\",\" & _xlpm.id & \",\")\n      )\n    )\n  )\n)","v":"15004: 5 | 15005: 5 | 15013: 5 | 15006: 5 | 15007: 5"},"데스나이트1",10026,null,null,"타락한 기사3",13027,"Melee"]
["스테이지 19-9",null,"트롤 워리어6, 트롤 워리어7, 바포메트5, 예티6, 트롤 워리어1, 트롤 워리어3, 바포메트5",{"$f":"_xlfn.TEXTJOIN(\", \", TRUE,\n    _xlfn.MAP(TRIM(_xlfn.TEXTSPLIT(C128, \",\")),\n        _xlfn.LAMBDA(_xlpm.n,\n            _xlfn.LET(\n                _xlpm.result, _xlfn.XLOOKUP(_xlpm.n, J:J, K:K, \"\"),\n                IF(_xlpm.result = \"\", _xlpm.n, _xlpm.result)\n            )\n        )\n    )\n)","v":"15018, 15019, 13013, 15010, 15014, 15016, 13013"},{"$f":"_xlfn.TEXTJOIN(\" | \", TRUE,\n  _xlfn.MAP(TRIM(_xlfn.TEXTSPLIT(D128, \",\")),\n    _xlfn.LAMBDA(_xlpm.id,\n      _xlpm.id & \": \" &\n      SUMPRODUCT(\n        (LEN(\",\" & SUBSTITUTE($D$2:$D$500,\" \",\"\") & \",\")\n         - LEN(SUBSTITUTE(\",\" & SUBSTITUTE($D$2:$D$500,\" \",\"\") & \",\", \",\" & _xlpm.id & \",\", \"\")))\n        / LEN(\",\" & _xlpm.id & \",\")\n      )\n    )\n  )\n)","v":"15018: 5 | 15019: 5 | 13013: 7 | 15010: 6 | 15014: 6 | 15016: 6 | 13013: 7"},"거미 여왕1",10025,null,null,"임프4",14026,"Melee"]
[null,null,null,null,null,null,null,null,null,"켄타우로스",14004,"Melee"]
["스테이지 20-1","⑧ 이계의 신전","오우거2, 싸이 전사, 예티6, 바포메트3, 예티6",{"$f":"_xlfn.TEXTJOIN(\", \", TRUE,\n    _xlfn.MAP(TRIM(_xlfn.TEXTSPLIT(C130, \",\")),\n        _xlfn.LAMBDA(_xlpm.n,\n            _xlfn.LET(\n                _xlpm.result, _xlfn.XLOOKUP(_xlpm.n, J:J, K:K, \"\"),\n                IF(_xlpm.result = \"\", _xlpm.n, _xlpm.result)\n            )\n        )\n    )\n)","v":"15011, 15001, 15010, 13011, 15010"},{"$f":"_xlfn.TEXTJOIN(\" | \", TRUE,\n  _xlfn.MAP(TRIM(_xlfn.TEXTSPLIT(D130, \",\")),\n    _xlfn.LAMBDA(_xlpm.id,\n      _xlpm.id & \": \" &\n      SUMPRODUCT(\n        (LEN(\",\" & SUBSTITUTE($D$2:$D$500,\" \",\"\") & \",\")\n         - LEN(SUBSTITUTE(\",\" & SUBSTITUTE($D$2:$D$500,\" \",\"\") & \",\", \",\" & _xlpm.id & \",\", \"\")))\n        / LEN(\",\" & _xlpm.id & \",\")\n      )\n    )\n  )\n)","v":"15011: 5 | 15001: 5 | 15010: 6 | 13011: 7 | 15010: 6"},null,null,null,null,"타이가",14006,"Melee"]
["스테이지 20-2",null,"엘더 예티1, 엘더 예티2, 예티3, 예티5, 바포메트5",{"$f":"_xlfn.TEXTJOIN(\", \", TRUE,\n    _xlfn.MAP(TRIM(_xlfn.TEXTSPLIT(C131, \",\")),\n        _xlfn.LAMBDA(_xlpm.n,\n            _xlfn.LET(\n                _xlpm.result, _xlfn.XLOOKUP(_xlpm.n, J:J, K:K, \"\"),\n                IF(_xlpm.result = \"\", _xlpm.n, _xlpm.result)\n            )\n        )\n    )\n)","v":"15006, 15007, 15008, 15009, 13013"},{"$f":"_xlfn.TEXTJOIN(\" | \", TRUE,\n  _xlfn.MAP(TRIM(_xlfn.TEXTSPLIT(D131, \",\")),\n    _xlfn.LAMBDA(_xlpm.id,\n      _xlpm.id & \": \" &\n      SUMPRODUCT(\n        (LEN(\",\" & SUBSTITUTE($D$2:$D$500,\" \",\"\") & \",\")\n         - LEN(SUBSTITUTE(\",\" & SUBSTITUTE($D$2:$D$500,\" \",\"\") & \",\", \",\" & _xlpm.id & \",\", \"\")))\n        / LEN(\",\" & _xlpm.id & \",\")\n      )\n    )\n  )\n)","v":"15006: 5 | 15007: 5 | 15008: 5 | 15009: 6 | 13013: 7"},"데스나이트1",10025,null,null,"리자드맨",14015,"Melee"]
["스테이지 20-3",null,"싸이 전사, 용암골렘1, 헤츨링2, 악마 광신자1, 예티5",{"$f":"_xlfn.TEXTJOIN(\", \", TRUE,\n    _xlfn.MAP(TRIM(_xlfn.TEXTSPLIT(C132, \",\")),\n        _xlfn.LAMBDA(_xlpm.n,\n            _xlfn.LET(\n                _xlpm.result, _xlfn.XLOOKUP(_xlpm.n, J:J, K:K, \"\"),\n                IF(_xlpm.result = \"\", _xlpm.n, _xlpm.result)\n            )\n        )\n    )\n)","v":"15001, 15013, 15003, 13016, 15009"},{"$f":"_xlfn.TEXTJOIN(\" | \", TRUE,\n  _xlfn.MAP(TRIM(_xlfn.TEXTSPLIT(D132, \",\")),\n    _xlfn.LAMBDA(_xlpm.id,\n      _xlpm.id & \": \" &\n      SUMPRODUCT(\n        (LEN(\",\" & SUBSTITUTE($D$2:$D$500,\" \",\"\") & \",\")\n         - LEN(SUBSTITUTE(\",\" & SUBSTITUTE($D$2:$D$500,\" \",\"\") & \",\", \",\" & _xlpm.id & \",\", \"\")))\n        / LEN(\",\" & _xlpm.id & \",\")\n      )\n    )\n  )\n)","v":"15001: 5 | 15013: 5 | 15003: 6 | 13016: 7 | 15009: 6"},null,null,null,null,"셀로브",14019,"Melee"]
["스테이지 20-4",null,"용암골렘1, 헤츨링2, 바포메트3",{"$f":"_xlfn.TEXTJOIN(\", \", TRUE,\n    _xlfn.MAP(TRIM(_xlfn.TEXTSPLIT(C133, \",\")),\n        _xlfn.LAMBDA(_xlpm.n,\n            _xlfn.LET(\n                _xlpm.result, _xlfn.XLOOKUP(_xlpm.n, J:J, K:K, \"\"),\n                IF(_xlpm.result = \"\", _xlpm.n, _xlpm.result)\n            )\n        )\n    )\n)","v":"15013, 15003, 13011"},{"$f":"_xlfn.TEXTJOIN(\" | \", TRUE,\n  _xlfn.MAP(TRIM(_xlfn.TEXTSPLIT(D133, \",\")),\n    _xlfn.LAMBDA(_xlpm.id,\n      _xlpm.id & \": \" &\n      SUMPRODUCT(\n        (LEN(\",\" & SUBSTITUTE($D$2:$D$500,\" \",\"\") & \",\")\n         - LEN(SUBSTITUTE(\",\" & SUBSTITUTE($D$2:$D$500,\" \",\"\") & \",\", \",\" & _xlpm.id & \",\", \"\")))\n        / LEN(\",\" & _xlpm.id & \",\")\n      )\n    )\n  )\n)","v":"15013: 5 | 15003: 6 | 13011: 7"},"레드 드래곤4",10027,null,null,"헤츨링1",15002,"Range"]
["스테이지 20-5",null,"트롤 워리어2, 트롤 워리어3, 오우거2, 악마 광신자1, 트롤 워리어1",{"$f":"_xlfn.TEXTJOIN(\", \", TRUE,\n    _xlfn.MAP(TRIM(_xlfn.TEXTSPLIT(C134, \",\")),\n        _xlfn.LAMBDA(_xlpm.n,\n            _xlfn.LET(\n                _xlpm.result, _xlfn.XLOOKUP(_xlpm.n, J:J, K:K, \"\"),\n                IF(_xlpm.result = \"\", _xlpm.n, _xlpm.result)\n            )\n        )\n    )\n)","v":"15015, 15016, 15011, 13016, 15014"},{"$f":"_xlfn.TEXTJOIN(\" | \", TRUE,\n  _xlfn.MAP(TRIM(_xlfn.TEXTSPLIT(D134, \",\")),\n    _xlfn.LAMBDA(_xlpm.id,\n      _xlpm.id & \": \" &\n      SUMPRODUCT(\n        (LEN(\",\" & SUBSTITUTE($D$2:$D$500,\" \",\"\") & \",\")\n         - LEN(SUBSTITUTE(\",\" & SUBSTITUTE($D$2:$D$500,\" \",\"\") & \",\", \",\" & _xlpm.id & \",\", \"\")))\n        / LEN(\",\" & _xlpm.id & \",\")\n      )\n    )\n  )\n)","v":"15015: 5 | 15016: 6 | 15011: 5 | 13016: 7 | 15014: 6"},null,null,null,null,"오우거3",15012,"Melee"]
["스테이지 20-6",null,"약탈꾼1, 엘더 예티1, 예티3, 예티5, 오우거2, 악마 광신자1",{"$f":"_xlfn.TEXTJOIN(\", \", TRUE,\n    _xlfn.MAP(TRIM(_xlfn.TEXTSPLIT(C135, \",\")),\n        _xlfn.LAMBDA(_xlpm.n,\n            _xlfn.LET(\n                _xlpm.result, _xlfn.XLOOKUP(_xlpm.n, J:J, K:K, \"\"),\n                IF(_xlpm.result = \"\", _xlpm.n, _xlpm.result)\n            )\n        )\n    )\n)","v":"15004, 15006, 15008, 15009, 15011, 13016"},{"$f":"_xlfn.TEXTJOIN(\" | \", TRUE,\n  _xlfn.MAP(TRIM(_xlfn.TEXTSPLIT(D135, \",\")),\n    _xlfn.LAMBDA(_xlpm.id,\n      _xlpm.id & \": \" &\n      SUMPRODUCT(\n        (LEN(\",\" & SUBSTITUTE($D$2:$D$500,\" \",\"\") & \",\")\n         - LEN(SUBSTITUTE(\",\" & SUBSTITUTE($D$2:$D$500,\" \",\"\") & \",\", \",\" & _xlpm.id & \",\", \"\")))\n        / LEN(\",\" & _xlpm.id & \",\")\n      )\n    )\n  )\n)","v":"15004: 5 | 15006: 5 | 15008: 5 | 15009: 6 | 15011: 5 | 13016: 7"},null,null,null,null,"임프 마법사2",14028,"Range"]
["스테이지 20-7",null,"트롤 워리어2, 트롤 워리어5, 악마 광신자1, 엘더 예티1",{"$f":"_xlfn.TEXTJOIN(\", \", TRUE,\n    _xlfn.MAP(TRIM(_xlfn.TEXTSPLIT(C136, \",\")),\n        _xlfn.LAMBDA(_xlpm.n,\n            _xlfn.LET(\n                _xlpm.result, _xlfn.XLOOKUP(_xlpm.n, J:J, K:K, \"\"),\n                IF(_xlpm.result = \"\", _xlpm.n, _xlpm.result)\n            )\n        )\n    )\n)","v":"15015, 15017, 13016, 15006"},{"$f":"_xlfn.TEXTJOIN(\" | \", TRUE,\n  _xlfn.MAP(TRIM(_xlfn.TEXTSPLIT(D136, \",\")),\n    _xlfn.LAMBDA(_xlpm.id,\n      _xlpm.id & \": \" &\n      SUMPRODUCT(\n        (LEN(\",\" & SUBSTITUTE($D$2:$D$500,\" \",\"\") & \",\")\n         - LEN(SUBSTITUTE(\",\" & SUBSTITUTE($D$2:$D$500,\" \",\"\") & \",\", \",\" & _xlpm.id & \",\", \"\")))\n        / LEN(\",\" & _xlpm.id & \",\")\n      )\n    )\n  )\n)","v":"15015: 5 | 15017: 5 | 13016: 7 | 15006: 5"},"레드 드레곤4",10027,null,null,"하피",14033,"Melee"]
["스테이지 20-8",null,"트롤 워리어7, 트롤 워리어2, 예티6, 예티5, 싸이 전사, 트롤 워리어1",{"$f":"_xlfn.TEXTJOIN(\", \", TRUE,\n    _xlfn.MAP(TRIM(_xlfn.TEXTSPLIT(C137, \",\")),\n        _xlfn.LAMBDA(_xlpm.n,\n            _xlfn.LET(\n                _xlpm.result, _xlfn.XLOOKUP(_xlpm.n, J:J, K:K, \"\"),\n                IF(_xlpm.result = \"\", _xlpm.n, _xlpm.result)\n            )\n        )\n    )\n)","v":"15019, 15015, 15010, 15009, 15001, 15014"},{"$f":"_xlfn.TEXTJOIN(\" | \", TRUE,\n  _xlfn.MAP(TRIM(_xlfn.TEXTSPLIT(D137, \",\")),\n    _xlfn.LAMBDA(_xlpm.id,\n      _xlpm.id & \": \" &\n      SUMPRODUCT(\n        (LEN(\",\" & SUBSTITUTE($D$2:$D$500,\" \",\"\") & \",\")\n         - LEN(SUBSTITUTE(\",\" & SUBSTITUTE($D$2:$D$500,\" \",\"\") & \",\", \",\" & _xlpm.id & \",\", \"\")))\n        / LEN(\",\" & _xlpm.id & \",\")\n      )\n    )\n  )\n)","v":"15019: 5 | 15015: 5 | 15010: 6 | 15009: 6 | 15001: 5 | 15014: 6"},null,null,null,8,"싸이 전사",15001,"Melee"]
["스테이지 20-9",null,"용암골렘1, 약탈꾼1, 약탈꾼2, 헤츨링2",{"$f":"_xlfn.TEXTJOIN(\", \", TRUE,\n    _xlfn.MAP(TRIM(_xlfn.TEXTSPLIT(C138, \",\")),\n        _xlfn.LAMBDA(_xlpm.n,\n            _xlfn.LET(\n                _xlpm.result, _xlfn.XLOOKUP(_xlpm.n, J:J, K:K, \"\"),\n                IF(_xlpm.result = \"\", _xlpm.n, _xlpm.result)\n            )\n        )\n    )\n)","v":"15013, 15004, 15005, 15003"},{"$f":"_xlfn.TEXTJOIN(\" | \", TRUE,\n  _xlfn.MAP(TRIM(_xlfn.TEXTSPLIT(D138, \",\")),\n    _xlfn.LAMBDA(_xlpm.id,\n      _xlpm.id & \": \" &\n      SUMPRODUCT(\n        (LEN(\",\" & SUBSTITUTE($D$2:$D$500,\" \",\"\") & \",\")\n         - LEN(SUBSTITUTE(\",\" & SUBSTITUTE($D$2:$D$500,\" \",\"\") & \",\", \",\" & _xlpm.id & \",\", \"\")))\n        / LEN(\",\" & _xlpm.id & \",\")\n      )\n    )\n  )\n)","v":"15013: 5 | 15004: 5 | 15005: 5 | 15003: 6"},"타락한 천사",10028,null,null,"약탈꾼2",15005,"Melee"]
[null,null,null,null,null,null,null,null,null,"예티6",15010,"Melee"]
["스테이지 21-1","⑧ 타락 천사의 수도원","헤츨링2, 바포메트3, 바포메트5",{"$f":"_xlfn.TEXTJOIN(\", \", TRUE,\n    _xlfn.MAP(TRIM(_xlfn.TEXTSPLIT(C140, \",\")),\n        _xlfn.LAMBDA(_xlpm.n,\n            _xlfn.LET(\n                _xlpm.result, _xlfn.XLOOKUP(_xlpm.n, J:J, K:K, \"\"),\n                IF(_xlpm.result = \"\", _xlpm.n, _xlpm.result)\n            )\n        )\n    )\n)","v":"15003, 13011, 13013"},{"$f":"_xlfn.TEXTJOIN(\" | \", TRUE,\n  _xlfn.MAP(TRIM(_xlfn.TEXTSPLIT(D140, \",\")),\n    _xlfn.LAMBDA(_xlpm.id,\n      _xlpm.id & \": \" &\n      SUMPRODUCT(\n        (LEN(\",\" & SUBSTITUTE($D$2:$D$500,\" \",\"\") & \",\")\n         - LEN(SUBSTITUTE(\",\" & SUBSTITUTE($D$2:$D$500,\" \",\"\") & \",\", \",\" & _xlpm.id & \",\", \"\")))\n        / LEN(\",\" & _xlpm.id & \",\")\n      )\n    )\n  )\n)","v":"15003: 6 | 13011: 7 | 13013: 7"},"레드 드레곤4",10027,null,null,"트롤 워리어2",15015,"Melee"]
["스테이지 21-2",null,"트롤 워리어1, 트롤 워리어2, 트롤 워리어3, 트롤 워리어5, 트롤 워리어6, 트롤 워리어7, 악마 광신자1",{"$f":"_xlfn.TEXTJOIN(\", \", TRUE,\n    _xlfn.MAP(TRIM(_xlfn.TEXTSPLIT(C141, \",\")),\n        _xlfn.LAMBDA(_xlpm.n,\n            _xlfn.LET(\n                _xlpm.result, _xlfn.XLOOKUP(_xlpm.n, J:J, K:K, \"\"),\n                IF(_xlpm.result = \"\", _xlpm.n, _xlpm.result)\n            )\n        )\n    )\n)","v":"15014, 15015, 15016, 15017, 15018, 15019, 13016"},{"$f":"_xlfn.TEXTJOIN(\" | \", TRUE,\n  _xlfn.MAP(TRIM(_xlfn.TEXTSPLIT(D141, \",\")),\n    _xlfn.LAMBDA(_xlpm.id,\n      _xlpm.id & \": \" &\n      SUMPRODUCT(\n        (LEN(\",\" & SUBSTITUTE($D$2:$D$500,\" \",\"\") & \",\")\n         - LEN(SUBSTITUTE(\",\" & SUBSTITUTE($D$2:$D$500,\" \",\"\") & \",\", \",\" & _xlpm.id & \",\", \"\")))\n        / LEN(\",\" & _xlpm.id & \",\")\n      )\n    )\n  )\n)","v":"15014: 6 | 15015: 5 | 15016: 6 | 15017: 5 | 15018: 5 | 15019: 5 | 13016: 7"},null,null,null,null,"악마 광신자1",13016,"Range"]
["스테이지 21-3",null,"트롤 워리어2, 헤츨링2, 엘더 예티2, 예티6, 엘더 예티2, 싸이 전사, 용암골렘1",{"$f":"_xlfn.TEXTJOIN(\", \", TRUE,\n    _xlfn.MAP(TRIM(_xlfn.TEXTSPLIT(C142, \",\")),\n        _xlfn.LAMBDA(_xlpm.n,\n            _xlfn.LET(\n                _xlpm.result, _xlfn.XLOOKUP(_xlpm.n, J:J, K:K, \"\"),\n                IF(_xlpm.result = \"\", _xlpm.n, _xlpm.result)\n            )\n        )\n    )\n)","v":"15015, 15003, 15007, 15010, 15007, 15001, 15013"},{"$f":"_xlfn.TEXTJOIN(\" | \", TRUE,\n  _xlfn.MAP(TRIM(_xlfn.TEXTSPLIT(D142, \",\")),\n    _xlfn.LAMBDA(_xlpm.id,\n      _xlpm.id & \": \" &\n      SUMPRODUCT(\n        (LEN(\",\" & SUBSTITUTE($D$2:$D$500,\" \",\"\") & \",\")\n         - LEN(SUBSTITUTE(\",\" & SUBSTITUTE($D$2:$D$500,\" \",\"\") & \",\", \",\" & _xlpm.id & \",\", \"\")))\n        / LEN(\",\" & _xlpm.id & \",\")\n      )\n    )\n  )\n)","v":"15015: 5 | 15003: 6 | 15007: 5 | 15010: 6 | 15007: 5 | 15001: 5 | 15013: 5"},"타락한 천사",10028,null,null,"용암골렘1",15013,"Melee"]
["스테이지 21-4",null,"헤츨링2",{"$f":"_xlfn.TEXTJOIN(\", \", TRUE,\n    _xlfn.MAP(TRIM(_xlfn.TEXTSPLIT(C143, \",\")),\n        _xlfn.LAMBDA(_xlpm.n,\n            _xlfn.LET(\n                _xlpm.result, _xlfn.XLOOKUP(_xlpm.n, J:J, K:K, \"\"),\n                IF(_xlpm.result = \"\", _xlpm.n, _xlpm.result)\n            )\n        )\n    )\n)","v":"15003"},{"$f":"_xlfn.TEXTJOIN(\" | \", TRUE,\n  _xlfn.MAP(TRIM(_xlfn.TEXTSPLIT(D143, \",\")),\n    _xlfn.LAMBDA(_xlpm.id,\n      _xlpm.id & \": \" &\n      SUMPRODUCT(\n        (LEN(\",\" & SUBSTITUTE($D$2:$D$500,\" \",\"\") & \",\")\n         - LEN(SUBSTITUTE(\",\" & SUBSTITUTE($D$2:$D$500,\" \",\"\") & \",\", \",\" & _xlpm.id & \",\", \"\")))\n        / LEN(\",\" & _xlpm.id & \",\")\n      )\n    )\n  )\n)","v":"15003: 6"},"타락한 천사",10028,null,null,"트롤 워리어1",15014,"Melee"]
[null,null,null,null,null,null,null,null,null,"트롤 워리어3",15016,"Melee"]
[null,null,null,null,null,null,null,null,null,"트롤 워리어5",15017,"Melee"]
[null,null,null,null,null,null,null,null,null,"바포메트5",13013,"Range"]
[null,null,null,null,null,null,null,null,null,"약탈꾼1",15004,"Melee"]
[null,null,null,null,null,null,null,null,null,"엘더 예티1",15006,"Melee"]
[null,null,null,null,null,null,null,null,null,"예티3",15008,"Melee"]
[null,null,null,null,null,null,null,null,null,"예티5",15009,"Melee"]
[null,null,null,null,null,null,null,null,null,"오우거2",15011,"Melee"]
[null,null,null,null,null,null,null,null,null,"바포메트3",13011,"Range"]
[null,null,null,null,null,null,null,null,null,"헤츨링2",15003,"Range"]
[null,null,null,null,null,null,null,null,null,"엘더 예티2",15007,"Melee"]
[null,null,null,null,null,null,null,null,null,"트롤 워리어6",15018,"Melee"]
[null,null,null,null,null,null,null,null,null,"트롤 워리어7",15019,"Melee"]